program: Gaussian 09
title: 000077577
version: EM64L-G09RevD.01
frameworkgroup: C1[X(C6H12N2O4)]
method: RPBEPBE
basis: SDD
operation: Freq
keyword: #p
keyword: freq=noraman
keyword: PBEPBE/SDD
title: #p freq=noraman PBEPBE/SDD
converged: NO YES NO NO
title: Mulliken charges:
elementType: O O O O N N C C C C C C H H H H H H H H H H H H
charge: -0.180857 -0.180853 -0.206717 -0.206717 0.094913 0.094911 0.259274 0.259282 -0.719020 -0.724165 -0.719023 -0.724169 0.233342 0.250781 0.244815 0.255590 0.262283 0.229755 0.233344 0.244818 0.250781 0.229757 0.262284 0.255591
chargesum: 0.00000
title: Mulliken charges with hydrogens summed into heavy atoms:
elementType: O O O O N N C C C C C C
charge: -0.180857 -0.180853 -0.206717 -0.206717 0.094913 0.094911 0.259274 0.259282 0.009918 0.023463 0.009919 0.023464
polarizability: 9.70800380e+01 -1.53820787e-03 1.00637989e+02 3.37553792e+00 1.02181356e-02 8.46875096e+01
1716.lowfreq: -7.7788 0.0002 0.0008 0.0009 11.9247 16.4032 50.7968 76.8435 82.4027
frequency: 50.7963 76.8399 82.3795 169.4693 191.1480 204.9672 225.5536 231.1761 248.2794 285.2921 290.4679 299.1161 340.5500 343.8133 358.6731 362.6449 414.3228 471.1013 499.7191 542.1178 558.2426 680.1118 686.3776 714.5394 762.7070 768.2365 877.1239 940.2919 946.7164 957.6551 1007.0047 1019.8166 1124.6247 1149.6439 1168.9410 1186.3665 1202.3327 1210.0213 1231.1147 1250.1892 1378.9275 1382.3468 1387.5843 1410.3213 1412.8883 1416.6059 1457.0944 1460.9565 1463.9976 1464.0236 1479.5973 1483.1921 1483.6091 1496.0316 3007.8362 3008.3045 3014.6748 3016.1719 3101.4015 3102.8657 3109.6372 3110.0704 3125.0007 3129.4173 3129.5870 3133.0905
redmass: 10.7719 8.3027 5.4950 6.3091 5.4052 1.0338 1.1275 1.3371 1.1311 2.2973 2.3253 2.6486 2.6444 5.4677 2.8398 3.1651 2.6674 5.0053 4.8790 4.2624 4.0855 7.2268 5.3851 2.9272 8.0956 9.0136 2.7611 1.4055 1.5741 1.8523 1.2549 1.2848 1.7312 2.1343 2.1535 4.0225 4.2415 9.5766 4.4399 5.0285 1.7719 1.2564 2.9651 1.4834 2.6223 1.1846 1.0640 1.0625 1.0646 1.0526 1.0534 1.0540 1.0783 1.0591 1.0364 1.0368 1.0368 1.0371 1.0999 1.0995 1.0994 1.0993 1.1008 1.1002 1.0993 1.0995
irintensity: 0.5647 0.0298 4.3754 13.3287 0.0126 0.3930 0.0940 0.1948 0.3626 0.0753 0.0413 1.5162 0.0119 0.4576 8.1602 0.1094 1.8635 3.6222 3.0274 0.0845 0.6310 0.0379 2.7325 0.0141 1.1275 59.0027 3.0924 0.0174 3.3321 0.3552 0.4771 0.4174 24.4229 0.3221 53.5511 11.1620 0.2124 147.8262 0.0172 1.5586 256.6053 2.1567 78.3143 11.1088 56.3941 2.1951 4.4242 3.8723 2.1438 9.3057 44.0491 8.1777 28.6384 0.5101 11.2828 6.3972 13.1676 0.8753 10.0861 0.1826 1.2104 21.1639 10.9047 10.5766 10.3449 1.0946
temp: 298.150 k
press: 1.00000 atm
elementType: 8 8 8 8 7 7 6 6 6 6 6 6 1 1 1 1 1 1 1 1 1 1 1 1
symmnumber: 1
zpe: 492237.7 jmol-1
zpe.correction: 0.187483 hartree
zpe.thermalcorrener: 0.200855 hartree
zpe.thermalcorrenthalpy: 0.201799 hartree
zpe.thermalcorrgfe: 0.148682 hartree
zpe.sumelectzpe: -645.109864 hartree
zpe.sumelectthermal: -645.096492 hartree
zpe.sumelectthermalent: -645.095548 hartree
zpe.sumelectthermalfe: -645.148665 hartree
dipole: 0.0001 1.0377 0.0006
dipole: 1.0377
quadrupole: -91.5240 -73.8704 -65.7545
quadrupole: 0.0049 -6.6372 -0.0056
quadrupole: -14.4744 3.1792 11.2951 0.0049 -6.6372 -0.0056
hfenergy: -645.2973471 hartree
pointgroup: C01 [X(C6H12N2O4)]
dipole: -0.0000279 -0.4082783 0.0000156 debye
dipolederiv: -0.4809143 -0.2595139 0.0620204 -0.1551678 -0.6657372 -0.1512232 0.1776314 -0.0351146 -0.2679575 -0.4808726 0.2594884 0.0620894 0.1550897 -0.6658362 0.1511417 0.1776397 0.0350593 -0.2679122 -0.4915247 0.1397226 0.1938624 -0.0286876 -0.6123625 -0.1297001 0.166668 -0.2541898 -0.3923076 -0.4915766 -0.1397808 0.1938759 0.0286522 -0.6124037 0.1296669 0.1666825 0.2540928 -0.3922432 0.8228812 0.1594069 -0.2749937 0.2301117 0.9977651 0.2881294 -0.4968177 0.2915605 0.2820085 0.8228705 -0.1593584 -0.2750775 -0.2300067 0.9979374 -0.2879816 -0.496874 -0.2913508 0.2819272 0.0901424 -0.071176 0.091392 -0.0921926 0.1452373 0.0136592 0.1471244 -0.0434407 0.2510048 0.0902002 0.0711776 0.0913948 0.0922037 0.145182 -0.0137046 0.147222 0.0433836 0.2509741 -0.0293861 -0.0176407 -0.029983 0.0021396 -0.0844646 -0.0685744 0.0113228 -0.062103 -0.0803678 -0.0879745 0.0225869 0.0067253 0.0484855 -0.0928571 0.0180933 0.0071182 0.0551991 -0.0412146 -0.0293809 0.0176342 -0.0299518 -0.0021607 -0.0845055 0.0685803 0.0113496 0.062105 -0.0803241 -0.0880198 -0.0225834 0.0067192 -0.0485025 -0.0928143 -0.0181074 0.0070705 -0.0552122 -0.0412315 -0.0113503 -0.0184931 0.1067043 -0.0358609 0.0717618 0.0414613 0.0811657 0.0139106 0.0478599 0.0956145 0.0329 -0.0120857 0.0425403 -0.0308575 0.0624555 -0.0093321 0.0890464 0.0620381 -0.0232757 -0.0137312 -0.1161594 0.0144377 0.0909267 -0.0129118 -0.0856438 -0.0093359 0.0274453 0.0001509 -0.0519739 0.0787958 -0.0342743 0.1011749 0.0128397 0.0734014 -0.0004325 0.1064841 0.1117276 0.0454333 0.0258597 0.0237521 0.0039538 -0.0538562 0.0363263 -0.0958562 0.0370641 0.0039035 0.0110132 -0.1321527 -0.0321123 0.0754706 -0.0266615 -0.1089904 0.0051721 -0.0320611 -0.0113401 0.0184835 0.1066989 0.0358627 0.0717587 -0.0414733 0.0811679 -0.0139273 0.0478457 -0.0232695 0.01379 -0.1161506 -0.0143889 0.0909242 0.0129516 -0.0856468 0.0093672 0.0274497 0.0956018 -0.0329281 -0.0121036 -0.0425701 -0.030798 -0.0624864 -0.0093623 -0.0890664 0.0619946 0.0039187 -0.0109617 -0.1321438 0.0321603 0.0754598 0.0267334 -0.1089822 -0.0051171 -0.0320663 0.1117098 -0.0454754 0.0258705 -0.0237963 0.0039327 0.053837 0.0363542 0.0958346 0.0371076 0.000164 0.0519799 0.0787931 0.0342852 0.1011518 -0.0128689 0.0734044 0.000415 0.1064822 unknown
polarizability: 96.6453779|-0.0000189|100.637996|-4.0733117|0.0009433|85.1221631 unknown
InChI: InChI=1S/C6H12N2O4/c1-5(2,7(9)10)6(3,4)8(11)12/h1-4H3
charge 0 multiplicity 1
24 atoms
O  2.476151 1.338216 -0.084536
O  -2.475889 1.338751 0.0847
O  2.395338 -0.799582 -0.845866
O  -2.395464 -0.799174 0.845719
N  1.921229 0.185145 -0.165992
N  -1.921131 0.185596 0.166066
C  0.54761 -0.044415 0.588888
C  -0.547555 -0.04411 -0.588858
C  0.352813 1.11748 1.579928
C  0.668678 -1.391832 1.327073
C  -0.352466 1.118003 -1.579597
C  -0.668967 -1.391299 -1.327397
H  -0.509671 0.894764 2.231004
H  0.181645 2.084663 1.084456
H  1.245369 1.218447 2.218187
H  -0.310823 -1.664033 1.753199
H  1.004765 -2.194508 0.65444
H  1.396509 -1.299687 2.1519
H  0.50998 0.895273 -2.230718
H  -1.244983 1.219343 -2.217848
H  -0.181085 2.085018 -1.083871
H  -1.396727 -1.298735 -2.15224
H  -1.005308 -2.194062 -0.654994
H  0.310482 -1.663664 -1.753544
