program: Gaussian 09
title: 000077586
version: EM64L-G09RevD.01
frameworkgroup: C1[X(C11H14O4)]
method: RPBEPBE
basis: SDD
operation: Freq
keyword: #pfreq=noraman
keyword: PBEPBE/SDD
title: #p freq=noraman PBEPBE/SDD
converged: NO YES NO NO
title: Mulliken charges:
elementType: O O O O C C C C C C C C C C C H H H H H H H H H H H H H H
charge: -0.265335 -0.438907 -0.488755 -0.243050 -0.558784 0.555746 -0.515631 -0.504281 -0.440782 0.254067 0.178336 -0.332882 0.128583 -0.226856 -0.672422 0.229608 0.229216 0.257526 0.260986 0.257530 0.235889 0.218951 0.227929 0.226815 0.210972 0.229573 0.230415 0.383450 0.372090
chargesum: 0.00000
title: Mulliken charges with hydrogens summed into heavy atoms:
elementType: O O O O C C C C C C C C C C C
charge: -0.265335 -0.055457 -0.116665 -0.243050 -0.099960 0.555746 0.002882 -0.246751 -0.204893 0.254067 0.178336 -0.113931 0.128583 0.227888 -0.001461
polarizability: 1.84505316e+02 7.38672504e+00 1.19930085e+02 1.32717413e+01 -9.86274481e+00 9.71432896e+01
1716.lowfreq: -16.0219 -6.3106 -0.0008 -0.0007 -0.0006 2.4157 8.3247 18.5488 42.0569
frequency: -4.7739 17.5405 42.0544 47.2264 59.3751 116.1519 142.4321 171.0671 205.5414 233.1755 246.7923 261.0458 274.7980 288.1756 327.3160 363.0693 426.6611 437.8584 453.5868 489.8796 512.9890 549.4498 568.4426 615.5717 669.3411 712.8420 743.2613 762.0151 776.5166 792.7341 799.3613 818.1669 877.6727 909.9506 917.1036 940.4648 1007.2014 1019.0013 1053.5694 1072.9209 1112.3083 1128.5381 1135.1136 1136.9792 1149.2122 1152.8041 1179.9480 1239.1777 1249.0760 1265.0444 1269.5487 1283.0425 1317.0645 1347.5789 1362.7018 1400.5264 1405.1618 1441.3309 1463.1670 1466.4728 1473.7802 1474.0970 1486.6703 1503.0677 1609.4601 1631.5741 1637.7449 2995.0491 2997.8774 3008.7326 3009.8132 3043.4372 3067.1562 3072.5160 3091.4495 3106.6019 3116.7682 3144.1503 3148.9980 3526.9791 3624.2582
redmass: 4.9189 4.3089 4.2380 3.2647 2.2595 5.0777 1.9576 6.0469 5.5306 3.4136 1.3073 1.2088 4.2249 3.1788 5.4562 4.2309 3.5376 4.3122 3.4579 1.1077 5.3350 2.6318 5.3531 4.4914 6.3812 3.9793 4.3505 3.5983 1.5062 1.5053 1.1009 3.5340 1.5999 1.5137 3.4160 3.2212 1.9259 2.2983 4.5598 2.1745 2.2968 2.7887 1.4583 1.2837 1.1770 1.7571 1.4242 1.8237 1.1369 1.3913 1.6955 1.9406 1.4866 1.4326 1.5917 1.2669 5.3506 1.0858 1.0402 3.1258 1.0816 1.0745 1.0702 3.3475 7.0330 6.7640 9.6106 1.0359 1.0612 1.0585 1.0601 1.0986 1.1066 1.1026 1.0985 1.1025 1.0882 1.0939 1.0941 1.0648 1.0666
irintensity: 1.0044 1.3201 1.1099 0.5200 0.1244 0.1616 6.8892 0.1725 2.8405 45.3522 3.2907 138.2041 8.9706 3.1908 9.7069 3.6729 4.9527 4.3017 14.5517 133.3215 30.2196 1.5812 2.5732 8.8844 0.2104 0.5933 4.5963 25.3699 13.0095 49.7573 3.1320 3.9800 26.0602 1.1790 17.8844 22.2734 8.6558 27.2532 130.0798 162.4493 19.2650 270.6636 7.0358 24.5546 1.9972 126.4092 64.9973 60.8212 0.0779 82.8954 103.5241 65.5975 41.6373 17.0599 20.8912 18.6014 3.8637 22.7788 11.9451 4.9265 11.3318 8.6550 13.3145 134.4208 41.0626 2.8755 173.7917 21.1970 6.9088 8.9384 33.9745 0.1524 7.3514 20.2547 31.7959 45.1776 16.5476 15.9905 1.5344 81.4299 56.4623
temp: 298.150 k
press: 1.00000 atm
elementType: 8 8 8 8 6 6 6 6 6 6 6 6 6 6 6 1 1 1 1 1 1 1 1 1 1 1 1 1 1
symmnumber: 1
zpe: 604098.0 jmol-1
zpe.correction: 0.230089 hartree
zpe.thermalcorrener: 0.245112 hartree
zpe.thermalcorrenthalpy: 0.246056 hartree
zpe.thermalcorrgfe: 0.185961 hartree
zpe.sumelectzpe: -727.333233 hartree
zpe.sumelectthermal: -727.318210 hartree
zpe.sumelectthermalent: -727.317266 hartree
zpe.sumelectthermalfe: -727.377360 hartree
dipole: 0.7417 -0.8015 3.0563
dipole: 3.2455
quadrupole: -62.3955 -90.2517 -90.8330
quadrupole: -12.0204 5.4100 -6.1426
quadrupole: 18.7645 -9.0916 -9.6729 -12.0204 5.4100 -6.1426
hfenergy: -727.5633213 hartree
pointgroup: C01 [X(C11H14O4)]
dipole: 0.2853842 0.6009294 -1.0898983 debye
polarizability: 184.4549391|-3.6122723|123.2030006|-14.9310248|-3.3562879|93.920751 unknown
InChI: InChI=1S/C11H14O4/c1-2-15-11(14)6-4-8-3-5-9(12)10(13)7-8/h3,5,7,12-13H,2,4,6H2,1H3
charge 0 multiplicity 1
29 atoms
O  -3.738886 -0.311364 -0.547851
O  3.635397 -2.137887 0.182381
O  4.984068 -0.082953 -0.928571
O  -3.261968 0.772155 1.459931
C  -0.41282 0.655487 0.963291
C  1.021685 0.509707 0.47524
C  -1.427012 0.117356 -0.075799
C  1.680329 -0.744867 0.563108
C  1.710573 1.605736 -0.100915
C  -2.868147 0.246271 0.392691
C  2.993106 -0.899147 0.084923
C  3.033423 1.460229 -0.586287
C  3.668057 0.209897 -0.492442
C  -5.197519 -0.250921 -0.213162
C  -5.939685 -0.919588 -1.365576
H  -0.644504 1.714939 1.173705
H  -0.558499 0.111219 1.914511
H  -1.32289 0.656159 -1.037233
H  -1.227343 -0.945655 -0.308504
H  1.186042 -1.612908 1.01289
H  1.217203 2.581838 -0.167336
H  3.558689 2.317541 -1.026399
H  -5.353427 -0.768093 0.750914
H  -5.48019 0.809617 -0.083532
H  -7.027613 -0.903389 -1.170433
H  -5.749007 -0.392296 -2.315992
H  -5.622709 -1.970108 -1.481707
H  4.550835 -2.052768 -0.194123
H  5.430009 0.709192 -1.311725
