program: Gaussian 09
title: 000077569
version: EM64L-G09RevD.01
frameworkgroup: C1[X(C7H6BrNO2)]
method: RPBEPBE
basis: SDD
operation: Freq
keyword: #p
keyword: freq=noraman
keyword: PBEPBE/SDD
title: #p freq=noraman PBEPBE/SDD
converged: YES YES NO NO
title: Mulliken charges:
elementType: Br O O N C C C C C C C H H H H H H
charge: -0.010549 -0.190709 -0.200528 0.022285 0.415890 0.247338 -0.313883 -0.335049 -0.845959 -0.225877 -0.208843 0.244437 0.341080 0.284910 0.284173 0.244120 0.247164
chargesum: 0.00000
title: Mulliken charges with hydrogens summed into heavy atoms:
elementType: Br O O N C C C C C C C
charge: -0.010549 -0.190709 -0.200528 0.022285 0.415890 0.247338 -0.069446 -0.050876 -0.219970 0.018243 0.038321
polarizability: 1.32347349e+02 -1.04759656e+01 1.15888358e+02 -1.05200453e+01 -5.55125008e+00 6.97968034e+01
1716.lowfreq: -7.6577 -0.0005 -0.0003 -0.0003 3.7997 9.5854 32.7488 37.9971 82.5988
frequency: 32.5587 37.9333 82.5955 132.1924 239.8435 268.3123 349.6544 369.5943 416.9679 448.5972 528.5590 560.7563 583.2193 648.4379 668.5645 747.3331 763.5197 783.5746 829.2662 877.1406 893.7906 972.0793 1001.3707 1038.3040 1062.7488 1103.4042 1151.2033 1180.5568 1212.3634 1218.3018 1228.4884 1288.1998 1368.8221 1388.6566 1436.2437 1454.5695 1473.8757 1580.1383 1607.7129 3087.1842 3137.8999 3153.3550 3170.0168 3186.4064 3186.5738
redmass: 9.9257 14.4956 7.0121 5.3748 6.2965 6.8277 3.1474 7.0179 3.3878 5.1686 4.9371 6.5225 4.0236 7.0279 5.2274 3.7148 7.4015 1.4403 5.0089 1.4960 1.4439 1.3882 1.3562 2.8610 2.6544 1.4575 1.3863 1.0607 8.4674 2.8994 1.1497 1.4584 5.8775 7.5100 2.3760 1.1929 2.5375 6.3273 6.8801 1.0600 1.0880 1.0907 1.0958 1.0987 1.1068
irintensity: 0.7463 0.3963 1.3082 0.4530 0.5039 6.7326 3.2741 2.9829 0.8102 6.2502 6.9099 8.8452 40.4435 9.1883 20.8513 6.0481 20.9481 55.9580 11.1012 1.6309 1.0629 3.1962 0.6509 1.2782 3.6500 7.0427 6.0049 1.6827 204.4839 20.1472 23.6981 8.1517 144.3121 7.0209 16.2017 8.2373 11.8383 9.2304 2.4126 15.1654 2.9029 8.9908 10.2205 5.6730 4.2819
temp: 298.150 k
press: 1.00000 atm
elementType: 35 8 8 7 6 6 6 6 6 6 6 1 1 1 1 1 1
symmnumber: 1
zpe: 310735.3 jmol-1
zpe.correction: 0.118353 hartree
zpe.thermalcorrener: 0.128153 hartree
zpe.thermalcorrenthalpy: 0.129097 hartree
zpe.thermalcorrgfe: 0.080216 hartree
zpe.sumelectzpe: -488.123601 hartree
zpe.sumelectthermal: -488.113800 hartree
zpe.sumelectthermalent: -488.112856 hartree
zpe.sumelectthermalfe: -488.161737 hartree
dipole: 3.0832 -4.9478 1.0951
dipole: 5.9318
quadrupole: -67.0746 -76.2801 -73.0221
quadrupole: -4.9340 -3.0703 -1.5468
quadrupole: 5.0510 -4.1545 -0.8965 -4.9340 -3.0703 -1.5468
hfenergy: -488.2419536 hartree
pointgroup: C01 [X(C7H6Br1N1O2)]
dipole: -2.2201171 0.4318007 0.5753421 debye
dipolederiv: -0.324924 -0.2198592 0.0965145 -0.1970845 -0.2969765 0.086702 0.2849708 0.2604413 -0.3233806 -0.4694025 0.1971733 -0.0072152 0.139378 -0.6917955 -0.2402437 -0.0353414 -0.2478015 -0.380432 -0.6862073 -0.0138283 -0.2465765 -0.0170498 -0.4501844 -0.138291 -0.1809065 -0.1903164 -0.4116228 1.2955001 -0.4342031 0.2876422 -0.2969465 0.936069 0.4129807 0.2136085 0.4491119 0.5851278 0.0893002 0.0804395 -0.015823 -0.1661936 0.0581118 -0.0385606 -0.1706003 -0.0421785 -0.1051314 -0.366498 0.2276706 -0.038312 0.2264784 -0.0234397 -0.0511009 0.0208763 0.0083105 0.0094479 -0.2912081 -0.0782677 0.0075872 -0.1044991 0.0877594 0.0602816 -0.0122992 0.0324139 -0.1111862 -0.0303303 -0.234779 0.0093534 0.0473462 -0.0436112 0.0267728 0.0698112 -0.0500928 -0.0717799 0.3543244 0.3211741 -0.2432208 0.2605687 0.3097566 -0.1571422 -0.3184879 -0.2250376 0.450635 0.2004079 -0.0500649 -0.0039039 -0.0115976 0.0466375 0.0198834 0.0161764 0.0107944 -0.0976038 0.0474408 0.205494 0.0557512 0.0975656 -0.1245242 0.0575822 0.0531869 0.0280887 -0.1206589 0.0857008 -0.0020498 -0.0167876 0.0275276 -0.0758713 -0.0374038 0.0123189 -0.0353997 0.13056 0.0283493 -0.0836123 0.0252844 0.0239395 0.1586659 0.0827952 0.0341134 0.0715108 0.0033617 0.0343924 0.0677078 0.1166975 -0.0219044 -0.029539 -0.0257175 0.0877838 -0.0076413 -0.0207474 0.1189286 0.0342731 0.0079671 0.0073173 0.0354642 -0.0164557 -0.0273426 -0.0264902 0.1605755 -0.0667312 0.0536438 -0.0032163 0.0693782 0.0749794 -0.0097463 -0.0121285 -0.0107712 0.154688 -0.0190431 -0.070912 -0.0317422 -0.0842241 0.0284982 -0.0323362 -0.0357399 -0.0249425 0.1481471 unknown
polarizability: 133.0778786|10.1919725|117.2880077|-4.8491352|3.1813405|67.6666239 unknown
InChI: InChI=1S/C7H6BrNO2/c8-5-6-3-1-2-4-7(6)9(10)11/h1-4H,5H2
charge 0 multiplicity 1
17 atoms
Br 1.763368 2.487065 -1.104566
O  1.486106 -2.282934 -0.611778
O  2.273605 -0.709658 0.828026
N  1.338731 -1.213279 0.093591
C  -0.178143 0.829749 0.353113
C  -0.000949 -0.5585 0.076071
C  -1.510642 1.319879 0.308352
C  -1.087743 -1.407027 -0.233082
C  0.924724 1.807435 0.644238
C  -2.608214 0.482495 0.020427
C  -2.396688 -0.888429 -0.25275
H  -1.6773 2.387099 0.493011
H  1.771443 1.377564 1.188283
H  0.543119 2.720141 1.121503
H  -0.887502 -2.459011 -0.452413
H  -3.620717 0.898453 0.002895
H  -3.2403 -1.546842 -0.481522
