program: Gaussian 09
title: 000009701
version: EM64L-G09RevD.01
frameworkgroup: C1[X(C10H15NO2)]
method: RPBEPBE
basis: SDD
operation: Freq
keyword: #p
keyword: freq=noraman
keyword: PBEPBE/SDD
title: #p freq=noraman PBEPBE/SDD
converged: YES YES NO NO
title: Mulliken charges:
elementType: O O N C C C C C C C C C C H H H H H H H H H H H H H H H
charge: -0.467824 -0.432027 -0.285088 -0.114146 -0.265158 0.465898 -0.739078 -0.426700 -0.358045 -0.657188 -0.380841 -0.347194 0.278128 0.244396 0.203040 0.235697 0.205165 0.241178 0.285375 0.233458 0.263155 0.343836 0.195878 0.232272 0.222439 0.218860 0.250968 0.353543
chargesum: 0.00000
title: Mulliken charges with hydrogens summed into heavy atoms:
elementType: O O N C C C C C C C C C C
charge: -0.123988 -0.078484 0.000287 0.130250 -0.062117 0.465898 -0.057038 -0.193241 -0.094890 -0.006598 -0.161981 -0.096226 0.278128
polarizability: 1.81844867e+02 -6.78701687e+00 1.03933050e+02 -4.78069099e+00 -1.49909526e+01 9.30249768e+01
1716.lowfreq: -9.6872 0.0004 0.0008 0.0010 1.8526 4.3064 41.8285 48.4485 63.3131
frequency: 41.7401 48.3727 63.2266 97.7236 165.8702 180.9289 196.7510 219.5572 269.8076 285.8867 302.6594 325.4102 350.4131 359.5227 390.8692 408.8398 420.8610 498.3487 506.9101 542.1161 573.8850 633.4287 709.2786 729.6723 776.1310 803.4571 827.5156 835.2763 853.6865 878.7362 929.3177 956.8944 964.2862 1002.6155 1013.5637 1054.3567 1073.6231 1103.5331 1114.4053 1142.8196 1162.2180 1175.3245 1183.0090 1206.7688 1216.5017 1247.8415 1278.9189 1293.6125 1317.9859 1327.1330 1356.3331 1384.2471 1395.6860 1426.6722 1432.7150 1466.4675 1469.2752 1478.1332 1486.7022 1498.5660 1501.6652 1593.3852 1623.8318 2883.2016 2946.9697 2986.3605 2989.9255 3024.9436 3075.4595 3081.7458 3099.8947 3109.2916 3133.3499 3141.2814 3170.2094 3455.2087 3567.3431 3581.7245
redmass: 3.1452 3.9665 4.6454 2.4480 3.3295 5.3564 1.3167 1.3917 3.6247 1.6606 1.8452 1.7315 2.9057 1.1153 4.0793 3.0323 3.4568 4.0677 3.0749 2.7209 4.6596 6.9989 1.6873 3.3468 4.6039 1.4433 1.5917 3.9221 1.7957 1.9328 1.4509 4.3351 1.3734 2.6968 1.9262 1.6420 1.7086 1.4325 1.3859 1.3866 1.6451 1.1140 2.5827 1.8907 1.6438 2.8969 1.4681 1.4016 1.4182 1.3093 1.2561 1.2369 5.2936 2.5900 1.1824 1.1042 1.0631 1.1101 1.0614 1.2772 1.9447 6.4724 6.3890 1.0555 1.0828 1.0511 1.0708 1.0743 1.0994 1.0983 1.0999 1.0872 1.0964 1.0887 1.0961 1.0737 1.0661 1.0660
irintensity: 0.2625 1.5146 0.0784 1.7109 0.2038 0.4399 1.0647 2.1301 6.0721 3.2233 52.9720 78.7283 37.2558 141.9339 11.1448 0.2948 0.7557 31.2207 20.6431 15.9065 35.2650 1.4993 152.6826 21.8049 23.3654 40.9855 21.6037 13.6052 24.3710 3.6900 5.2353 74.1071 2.7516 0.6565 4.4076 2.4467 9.8971 77.8314 13.6770 236.4451 29.9966 2.3953 57.6701 14.1867 18.8573 35.2247 6.7520 11.2420 1.7252 14.3092 12.0041 18.6249 13.4253 10.1260 3.7668 28.3465 8.5769 0.7703 2.6447 79.5220 36.8605 14.5941 30.1189 101.8624 36.4644 8.7287 49.4802 59.6804 44.6679 27.5313 29.2919 17.5073 19.2540 4.2622 5.8055 3.4208 4.6337 42.8244
temp: 298.150 k
press: 1.00000 atm
elementType: 8 8 7 6 6 6 6 6 6 6 6 6 6 1 1 1 1 1 1 1 1 1 1 1 1 1 1 1
symmnumber: 1
zpe: 612620.8 jmol-1
zpe.correction: 0.233335 hartree
zpe.thermalcorrener: 0.247178 hartree
zpe.thermalcorrenthalpy: 0.248122 hartree
zpe.thermalcorrgfe: 0.192750 hartree
zpe.sumelectzpe: -594.236199 hartree
zpe.sumelectthermal: -594.222356 hartree
zpe.sumelectthermalent: -594.221412 hartree
zpe.sumelectthermalfe: -594.276784 hartree
dipole: 1.4973 -1.5442 2.6496
dipole: 3.4128
quadrupole: -79.1339 -74.7022 -77.8007
quadrupole: -5.1796 0.6740 -2.9966
quadrupole: -1.9216 2.5101 -0.5884 -5.1796 0.6740 -2.9966
hfenergy: -594.4695342 hartree
pointgroup: C01 [X(C10H15N1O2)]
dipole: 0.6176184 0.2747227 -1.1601212 debye
polarizability: 181.9165334|6.9438494|94.5946371|4.0882923|-15.4166439|102.2917231 unknown
InChI: InChI=1S/C10H15NO2/c1-7(11-2)10(13)8-3-5-9(12)6-4-8/h3-7,10-13H,1-2H3
charge 0 multiplicity 1
28 atoms
O  -1.631946 -1.878895 -0.163105
O  4.434761 0.245782 0.397117
N  -3.531675 0.001812 0.580407
C  -2.091255 0.335313 0.653307
C  -1.230225 -0.465519 -0.385681
C  0.266223 -0.282551 -0.215023
C  -1.849299 1.852103 0.539009
C  1.027213 0.450259 -1.157935
C  0.935261 -0.830069 0.915109
C  -4.27641 0.450967 -0.61356
C  2.414555 0.648259 -0.982662
C  2.317478 -0.644784 1.102504
C  3.057308 0.098772 0.152377
H  -1.747525 0.001664 1.653464
H  -1.524861 -0.154442 -1.412238
H  -0.799965 2.098985 0.773159
H  -2.066077 2.232845 -0.476627
H  -2.504989 2.380616 1.252373
H  -3.648484 -1.009767 0.728307
H  0.532742 0.874594 -2.040464
H  0.362037 -1.415415 1.64233
H  -1.030874 -2.463524 -0.690149
H  -3.871715 0.087951 -1.589084
H  -4.310016 1.554014 -0.650149
H  -5.318702 0.094285 -0.532662
H  2.988339 1.218424 -1.725115
H  2.840695 -1.063769 1.967245
H  4.864005 0.782193 -0.314752
