program: Gaussian 09
title: 000077602
version: EM64L-G09RevD.01
frameworkgroup: C1[X(C8H8Cl3O4P)]
method: RPBEPBE
basis: SDD
operation: Freq
keyword: #p
keyword: freq=noraman
keyword: PBEPBE/SDD
title: #p freq=noraman PBEPBE/SDD
converged: YES YES NO NO
title: Mulliken charges:
elementType: Cl Cl Cl P O O O O C C C C C C C C H H H H H H H H
charge: -0.004122 0.008961 0.007113 1.400567 -0.539118 -0.502434 -0.490903 -0.587075 0.540629 -0.331165 -0.282740 -0.071422 -0.185428 -0.099722 -0.482635 -0.479445 0.319396 0.285761 0.248821 0.238397 0.255264 0.242232 0.263871 0.245197
chargesum: 0.00000
title: Mulliken charges with hydrogens summed into heavy atoms:
elementType: Cl Cl Cl P O O O O C C C C C C C C
charge: -0.004122 0.008961 0.007113 1.400567 -0.539118 -0.502434 -0.490903 -0.587075 0.540629 -0.331165 0.036656 -0.071422 0.100333 -0.099722 0.259847 0.271854
polarizability: 2.07119406e+02 1.84798847e+01 1.63984171e+02 -8.34129335e+00 7.57258313e+00 9.06492360e+01
1716.lowfreq: -6.4463 -2.3500 -0.0007 0.0015 0.0023 5.5073 14.8984 26.5460 46.8820
frequency: 14.6339 26.4431 46.8504 59.1345 74.4199 77.3224 87.7805 108.8467 130.8066 144.1595 160.0256 178.3671 185.1314 199.8366 220.1572 242.0890 292.6967 310.9306 329.3188 350.5197 368.2455 401.7951 429.8597 447.8325 499.5396 511.9147 587.5957 610.0346 638.6688 659.9863 690.4124 704.9357 757.3526 852.2596 883.1668 894.0097 953.2386 956.8213 1036.0156 1064.3245 1113.0032 1114.6248 1115.5270 1129.4240 1132.5251 1223.1902 1241.0774 1325.2056 1363.1096 1425.0879 1427.0859 1446.0012 1456.1022 1458.5091 1471.2498 1473.4012 1558.8101 1580.4684 2996.7139 3003.7916 3103.4193 3116.0222 3139.1679 3146.6125 3158.2811 3182.2949
redmass: 6.0993 6.3894 4.5640 5.8310 5.0996 1.5220 1.5531 1.2685 8.8164 5.4558 10.7187 6.3395 17.5054 9.0084 6.8642 8.9616 7.8473 20.9254 11.1750 11.0112 8.7238 7.9710 9.2752 3.4191 11.7144 7.0885 9.5404 10.6991 9.3286 7.9986 3.7947 10.8641 12.0024 1.4520 1.4375 8.1543 11.4553 11.8004 6.9751 13.9949 1.2355 1.2358 1.8341 1.2838 1.2946 5.6127 1.2296 9.0351 11.0136 1.1225 1.1219 2.8611 1.0553 1.0594 1.0532 1.0564 9.1676 8.3608 1.0290 1.0285 1.1060 1.1056 1.1045 1.1058 1.0936 1.0930
irintensity: 1.3482 2.4540 0.5989 3.9337 4.0611 1.2805 1.0727 0.5714 1.3448 2.7529 2.5572 4.7921 1.8663 0.4806 2.5483 8.3422 9.7048 4.9864 39.8131 2.7697 20.1644 12.9686 6.0348 12.1115 30.9712 11.3164 35.5502 22.3007 43.8957 74.7220 5.3170 132.2877 238.6369 4.2872 37.5325 116.9977 115.3124 255.0026 125.2634 115.3395 0.1998 0.9687 64.0560 0.6908 1.1353 100.0006 2.9336 82.8255 9.6917 4.1489 7.2944 276.3394 16.1159 26.2463 25.7781 7.4410 1.9417 15.5900 43.0600 31.0791 22.4675 18.5959 8.4378 10.4793 6.8088 1.1040
temp: 298.150 k
press: 1.00000 atm
elementType: 17 17 17 15 8 8 8 8 6 6 6 6 6 6 6 6 1 1 1 1 1 1 1 1
symmnumber: 1
zpe: 395295.1 jmol-1
zpe.correction: 0.150560 hartree
zpe.thermalcorrener: 0.169277 hartree
zpe.thermalcorrenthalpy: 0.170222 hartree
zpe.thermalcorrgfe: 0.099969 hartree
zpe.sumelectzpe: -2330.705673 hartree
zpe.sumelectthermal: -2330.686956 hartree
zpe.sumelectthermalent: -2330.686012 hartree
zpe.sumelectthermalfe: -2330.756264 hartree
dipole: 2.4843 1.9898 2.8215
dipole: 4.2535
quadrupole: -115.1461 -122.5300 -118.7448
quadrupole: 3.1494 7.8664 -8.0108
quadrupole: 3.6608 -3.7230 0.0621 3.1494 7.8664 -8.0108
hfenergy: -2330.8562333 hartree
pointgroup: C01 [X(C8H8Cl3O4P1)]
dipole: 0.8738029 -0.4370861 -1.358616 debye
dipolederiv: -0.2040762 0.2085929 0.0886392 0.2421994 -0.4897842 -0.2272172 0.1194752 -0.2488406 -0.1525654 -0.1812133 0.1917527 0.1009645 0.2734535 -0.4764494 -0.2564332 0.1412199 -0.2461478 -0.1587694 -0.7611411 0.1036798 -0.086407 0.0983945 -0.0637405 -0.0066516 -0.1304304 0.002474 -0.0459676 2.8296054 -0.2513129 -0.0156522 0.6155248 1.8478493 -0.0953566 -0.1267019 -0.5379165 1.7646779 -2.3687436 -0.0765365 -0.1170601 -0.2445793 -0.47624 0.0055894 -0.3848489 0.0158913 -0.4310506 -0.6967963 -0.0797451 0.1163859 -0.3400537 -0.9277069 0.336481 0.323253 0.530626 -0.9265586 -0.8524371 0.3331376 0.0596103 0.4025545 -1.1127948 -0.0603513 0.152622 -0.1181411 -0.538556 -0.7771543 -0.0060058 -0.01867 -0.1091211 -0.6132756 -0.0298559 0.0097913 0.0493384 -0.6513841 1.6041658 0.1849584 0.1810012 -0.3918913 -0.087847 -0.0740486 0.2708215 -0.0432013 0.1284387 -0.0347797 -0.3464214 -0.1304263 -0.3848051 0.6958479 0.3906437 -0.1684383 0.4199905 0.1273071 -0.308843 0.0133604 0.0095799 0.21294 -0.1996128 -0.0588531 0.0780884 -0.0756567 -0.1357059 0.060814 -0.3078623 -0.1774574 -0.3616649 0.7216112 0.4545459 -0.2240229 0.4196824 0.205579 -0.2300486 0.0574366 -0.0142065 0.101318 -0.1578323 -0.0431501 0.0008622 -0.0695999 -0.0602264 1.0399176 -0.0688115 0.2190111 -0.1126186 -0.1057808 -0.0732211 0.2188041 -0.0519854 -0.0606371 0.3448481 0.1833672 -0.1470464 0.2649341 0.6082635 -0.3809117 -0.0644776 -0.1224612 0.2701889 0.2549602 -0.0276136 -0.0493062 -0.2613026 0.6023562 0.0529728 -0.2617517 0.2709777 0.2662099 0.1341231 -0.0046991 -0.042832 0.0019373 0.1019754 -0.0379363 -0.0313114 -0.0379266 0.1454464 0.0717609 -0.0112949 -0.0270077 -0.0052324 0.0840068 -0.0581764 -0.0338426 -0.0530936 0.1243185 0.0832601 -0.0305068 -0.0430103 -0.0448767 0.0477048 0.0483902 -0.0264841 0.0618126 -0.0829034 -0.1604742 -0.0706261 0.0361275 -0.0384703 0.0197063 0.0625941 -0.0184056 0.0152361 0.0906882 0.0488467 0.0483427 0.0656612 0.0205595 -0.0384234 0.0068481 0.048907 -0.1024602 0.0569836 0.1174734 -0.0161721 0.0158658 0.00996 0.0217499 0.0536843 0.0783832 -0.0275363 -0.1025893 0.0318358 -0.1284461 0.0312768 -0.0566353 -0.0143037 -0.0128339 0.0727859 -0.041384 0.0783399 -0.0459037 0.101426 -0.0550411 0.1074757 0.0127199 0.0032476 -0.0442983 -0.0096778 0.0887357 unknown
polarizability: 200.7900552|-26.2403198|154.8461836|1.279504|31.6883117|106.1165744 unknown
InChI: InChI=1S/C8H8Cl3O4P/c1-13-16(12,14-2)15-8-4-6(10)5(9)3-7(8)11/h3-4H,1-2H3
charge 0 multiplicity 1
24 atoms
Cl -0.292015 -2.741456 -1.333104
Cl -2.893162 2.467189 1.380951
Cl -4.737715 0.429994 -0.434904
P  2.418033 0.413667 0.421455
O  1.114929 -0.754648 0.410627
O  2.457586 0.791657 -1.263133
O  3.697299 -0.659225 0.742501
O  2.316752 1.644537 1.409782
C  -0.229828 -0.406575 0.205239
C  -1.029229 -1.278766 -0.570425
C  -0.815082 0.732508 0.803984
C  -2.184092 0.997172 0.606995
C  -2.3987 -1.020552 -0.75558
C  -2.977152 0.123873 -0.168407
C  2.916065 2.145982 -1.676845
C  3.853884 -1.902067 -0.067525
H  -0.205385 1.399532 1.422034
H  -3.011235 -1.697748 -1.355763
H  2.592843 2.233391 -2.724176
H  4.015112 2.216648 -1.605502
H  2.444037 2.926756 -1.056331
H  3.975967 -1.651009 -1.135148
H  2.981675 -2.55931 0.0779
H  4.768313 -2.36275 0.332374
