program: Gaussian 09
title: 000077635
version: EM64L-G09RevD.01
frameworkgroup: C1[X(C15H11Cl2NO2)]
method: RPBEPBE
basis: SDD
operation: Freq
keyword: #p
keyword: freq=noraman
keyword: PBEPBE/SDD
title: #p freq=noraman PBEPBE/SDD
converged: YES YES NO NO
title: Mulliken charges:
elementType: Cl Cl O O N C C C C C C C C C C C C C C C H H H H H H H H H H H
charge: -0.049441 -0.049688 -0.276023 -0.251885 -0.448625 0.147043 0.304502 0.070446 0.294244 -0.297300 -0.335943 -0.158417 -0.226559 -0.367170 -0.360035 -0.232853 -0.228772 0.247344 -0.226016 -0.683177 0.299644 0.319598 0.402711 0.262326 0.271963 0.270784 0.236958 0.236635 0.237134 0.294781 0.295792
chargesum: 0.00000
title: Mulliken charges with hydrogens summed into heavy atoms:
elementType: Cl Cl O O N C C C C C C C C C C C C C C C
charge: -0.049441 -0.049688 -0.276023 -0.251885 -0.045914 0.147043 0.304502 0.070446 0.294244 0.002344 -0.016345 -0.158417 0.035768 -0.095207 -0.089252 0.004106 0.007863 0.247344 0.011118 -0.092604
polarizability: 2.78353079e+02 -1.49317156e+01 2.43556161e+02 1.80181727e+00 1.89256975e+01 1.01971986e+02
1716.lowfreq: -3.3584 -0.0025 -0.0023 -0.0021 2.4777 5.7994 15.0288 33.6951 51.9029
frequency: 14.9413 33.6355 51.8905 59.9042 68.4788 84.8668 92.0215 135.1303 149.2813 163.2157 183.2731 226.3589 245.4915 293.8499 335.2551 347.2200 381.6667 396.1029 405.6983 421.1644 433.7413 445.3620 513.3068 529.7307 574.4963 589.8112 614.4018 648.5765 667.8933 684.0162 703.9070 708.2585 747.8321 761.4836 803.7853 842.4209 852.4343 859.9397 902.7888 906.3528 921.4142 942.9521 948.8611 972.1165 987.1042 988.9111 989.3781 1006.1316 1026.9623 1086.2812 1094.2095 1111.4450 1163.4793 1164.2874 1176.5058 1190.9214 1218.7540 1240.9332 1265.5697 1275.4168 1294.9976 1320.0430 1373.7362 1382.8479 1388.0779 1417.1650 1429.3088 1439.9933 1477.7789 1498.3820 1542.5713 1568.8419 1584.0917 1594.0352 1605.9645 1607.2886 3064.9992 3132.6724 3142.0386 3143.5875 3152.6253 3155.5815 3162.3754 3166.3081 3172.7655 3179.2053 3191.4275
redmass: 8.5830 8.2196 4.6349 3.5055 6.1246 5.3069 11.8892 6.7431 13.0859 6.5818 7.4740 5.7085 8.1369 6.7054 8.9042 6.4312 12.7955 6.6407 2.8661 7.7741 4.9221 4.4109 4.4630 4.1122 3.2151 6.0439 6.4518 6.8078 6.5861 5.5021 1.8880 4.8042 2.8885 6.1260 2.9039 5.5705 1.4358 1.2564 1.7380 1.5917 3.8522 3.2296 1.7263 1.1625 1.3454 3.7274 1.5791 1.3357 2.2386 1.6192 2.1280 2.5362 1.1141 1.8251 1.0555 1.1206 3.1140 1.7966 1.2125 2.4471 2.0468 1.3617 9.6175 8.3111 4.2302 1.1560 2.4909 2.6189 2.2649 3.6596 4.2827 5.1466 6.0868 4.8717 4.8715 6.0233 1.0567 1.0853 1.0882 1.1084 1.0925 1.0826 1.0963 1.0911 1.1011 1.0920 1.0957
irintensity: 1.0381 0.1584 0.4630 3.3501 0.4367 10.6930 1.4815 1.9626 4.6706 0.3589 4.9336 0.7298 1.4413 1.1642 10.0956 3.9445 14.1336 6.1895 0.7094 12.9233 6.5920 2.9614 4.9372 18.1381 1.9159 2.5501 0.1932 40.8975 18.7064 2.6113 40.5069 102.2273 9.5748 39.6624 17.3235 11.3351 45.5970 5.6227 0.6174 16.5718 14.6164 28.9238 21.3681 87.5616 8.3663 4.7575 1.5404 0.6812 4.7524 14.5111 16.9374 3.8998 0.5645 15.3025 0.2214 26.9143 14.7848 22.6610 14.0670 344.2603 190.4348 25.0967 92.2710 4.8685 28.5096 46.5452 23.8292 36.0532 6.4939 721.3099 72.8848 483.9178 2.3814 54.9522 27.2082 13.3241 4.5504 0.1563 4.3054 0.9734 5.2582 253.3294 20.2864 0.3271 15.9683 0.3486 11.0336
temp: 298.150 k
press: 1.00000 atm
elementType: 17 17 8 8 7 6 6 6 6 6 6 6 6 6 6 6 6 6 6 6 1 1 1 1 1 1 1 1 1 1 1
symmnumber: 1
zpe: 585215.1 jmol-1
zpe.correction: 0.222897 hartree
zpe.thermalcorrener: 0.240693 hartree
zpe.thermalcorrenthalpy: 0.241637 hartree
zpe.thermalcorrgfe: 0.173928 hartree
zpe.sumelectzpe: -1702.141316 hartree
zpe.sumelectthermal: -1702.123519 hartree
zpe.sumelectthermalent: -1702.122575 hartree
zpe.sumelectthermalfe: -1702.190285 hartree
dipole: 2.7921 -0.8915 0.5020
dipole: 2.9736
quadrupole: -118.7790 -132.8960 -128.5875
quadrupole: -9.9327 3.6533 0.8257
quadrupole: 7.9752 -6.1419 -1.8333 -9.9327 3.6533 0.8257
hfenergy: -1702.3642126 hartree
pointgroup: C01 [X(C15H11Cl2N1O2)]
dipole: -1.1381431 -0.0594189 0.2641761 debye
polarizability: 283.8321194|-0.864719|238.4681703|-5.7886011|-16.6156153|101.5809365 unknown
InChI: InChI=1S/C15H11Cl2NO2/c16-9-14(19)18-13-7-6-11(17)8-12(13)15(20)10-4-2-1-3-5-10/h1-8,18H,9H2
charge 0 multiplicity 1
31 atoms
Cl -0.814943 -4.551684 -0.463731
Cl 2.86179 3.673272 -0.414077
O  -0.115941 1.843865 -0.656225
O  4.422325 -0.019256 0.286125
N  2.216806 0.692109 -0.187608
C  0.076971 -0.529779 -0.276541
C  1.51898 -0.539793 -0.186154
C  -0.696774 0.747607 -0.327556
C  -2.156943 0.791821 0.011897
C  -0.611554 -1.772381 -0.371521
C  2.202612 -1.785523 -0.106022
C  0.09561 -2.979333 -0.323988
C  1.496433 -3.000562 -0.173481
C  -2.73594 -0.009288 1.034588
C  -2.961449 1.7562 -0.654349
C  -4.09939 0.141415 1.367347
C  -4.326673 1.889414 -0.334484
C  3.56697 0.88543 0.031018
C  -4.899997 1.080675 0.676827
C  4.111695 2.31492 -0.038409
H  -1.694778 -1.779919 -0.51114
H  3.288485 -1.783903 0.000424
H  1.614199 1.51556 -0.41201
H  2.035722 -3.951189 -0.125755
H  -2.116547 -0.717436 1.594476
H  -2.49505 2.391818 -1.413911
H  -4.53405 -0.468053 2.166765
H  -4.942683 2.623737 -0.864257
H  -5.960111 1.189219 0.931254
H  4.873357 2.367052 -0.830562
H  4.56677 2.569287 0.930259
