program: Gaussian 09
title: 000077582
version: EM64L-G09RevD.01
frameworkgroup: C1[X(C14H11NO)]
method: RPBEPBE
basis: SDD
operation: Freq
keyword: #p
keyword: freq=noraman
keyword: PBEPBE/SDD
title: #p freq=noraman PBEPBE/SDD
converged: YES YES NO NO
title: Mulliken charges:
elementType: O N C C C C C C C C C C C C C C H H H H H H H H H H H
charge: -0.229569 0.003513 -0.597161 -0.602646 0.428247 0.444726 0.106354 0.146803 -0.020050 -0.426825 -0.370979 -0.327178 -0.435777 -0.226444 -0.253151 -0.333229 0.240149 0.227833 0.238291 0.220848 0.236026 0.238711 0.287840 0.287147 0.234231 0.238344 0.243946
chargesum: 0.00000
title: Mulliken charges with hydrogens summed into heavy atoms:
elementType: O N C C C C C C C C C C C C C C
charge: -0.229569 0.003513 -0.129179 -0.143507 0.428247 0.444726 0.106354 0.146803 -0.020050 -0.190799 -0.132268 -0.039338 -0.148630 0.007787 -0.014807 -0.089283
polarizability: 2.34308938e+02 3.31842480e+00 1.61880096e+02 2.67808812e+00 6.94436985e-01 7.64918730e+01
1716.lowfreq: -8.0085 -0.0008 -0.0007 -0.0004 8.2316 10.5158 21.9785 92.2859 117.8615
frequency: 21.7069 92.2841 117.8576 149.1901 190.7656 253.3993 286.9739 299.8052 303.4693 375.7568 397.6334 440.3608 454.6594 502.7927 527.5264 530.2374 580.2935 592.5540 634.7898 689.1049 696.3877 733.5568 765.0043 785.7953 800.3015 804.5877 845.1765 889.4846 900.1862 929.1901 941.5891 959.2678 972.0290 981.4202 1011.0831 1036.1682 1041.5168 1061.3300 1096.6872 1141.4148 1153.1329 1165.9918 1177.3076 1201.0577 1216.9813 1233.4988 1249.3027 1284.3025 1297.8134 1315.1532 1329.4709 1362.9758 1382.2640 1392.2571 1428.3898 1457.3115 1462.6850 1469.0153 1479.5254 1507.6035 1553.1872 1570.9319 1580.4097 1609.3364 2972.2922 2991.5203 3040.1478 3054.2417 3121.2804 3128.6462 3139.4110 3151.3892 3155.0542 3159.6669 3169.7504
redmass: 5.9128 4.1858 4.8656 3.7993 3.5104 4.7571 4.7897 3.5717 3.8856 3.9454 5.5882 3.1812 3.1345 4.2666 5.2489 3.7680 4.8101 3.4659 6.8902 5.0767 5.2040 2.7389 2.0625 2.5486 4.2737 2.7317 1.3820 1.4793 3.5891 2.5467 1.5153 2.1370 1.5466 1.4241 1.3490 3.1234 2.7962 2.2457 2.3302 2.1172 1.8130 1.6305 1.0892 1.8090 1.3837 1.7598 1.9549 1.5676 1.7465 6.3196 1.6649 1.6803 3.7911 2.1251 2.3140 1.4020 1.7126 1.2668 1.6879 9.2773 6.8732 6.5129 6.7777 6.2412 1.0651 1.0616 1.0973 1.0993 1.0871 1.0875 1.0896 1.0960 1.0937 1.0939 1.0993
irintensity: 0.7828 0.9272 1.0667 0.1227 0.1902 2.0909 2.0695 1.8943 1.6919 8.1832 0.7196 2.2676 5.0220 2.4904 1.6028 0.3555 7.1998 22.7080 12.8531 8.0333 8.2980 8.0274 37.4868 23.6119 8.9564 0.2335 35.4026 3.6366 53.2450 8.0246 9.0004 0.5588 2.5741 2.5570 0.5231 0.6986 1.5664 0.8496 16.7618 1.4362 12.3493 10.5610 1.8310 19.3788 0.4196 1.8568 72.4181 113.4684 94.3272 22.8921 6.5288 15.8036 8.7528 3.5762 18.4368 11.6913 9.5973 8.7915 11.1812 99.2433 24.1075 75.2979 60.8764 19.9832 13.8300 19.7043 24.6904 28.6849 5.8330 5.6503 14.7440 35.2486 9.1723 2.0557 29.4781
temp: 298.150 k
press: 1.00000 atm
elementType: 8 7 6 6 6 6 6 6 6 6 6 6 6 6 6 6 1 1 1 1 1 1 1 1 1 1 1
symmnumber: 1
zpe: 555047.2 jmol-1
zpe.correction: 0.211406 hartree
zpe.thermalcorrener: 0.223305 hartree
zpe.thermalcorrenthalpy: 0.224249 hartree
zpe.thermalcorrgfe: 0.172557 hartree
zpe.sumelectzpe: -668.963663 hartree
zpe.sumelectthermal: -668.951764 hartree
zpe.sumelectthermalent: -668.950820 hartree
zpe.sumelectthermalfe: -669.002512 hartree
dipole: 2.5729 -5.2754 0.1049
dipole: 5.8703
quadrupole: -87.2341 -91.4285 -95.9509
quadrupole: 8.9067 -3.2558 -1.2641
quadrupole: 4.3037 0.1093 -4.4131 8.9067 -3.2558 -1.2641
hfenergy: -669.1750692 hartree
pointgroup: C01 [X(C14H11N1O1)]
dipole: 1.0863968 -2.0192231 -0.2765594 debye
polarizability: 233.7264228|4.7251597|159.4552968|7.6136636|15.1565165|79.4991872 unknown
InChI: InChI=1S/C14H11NO/c16-14-12-4-2-1-3-10(12)5-6-11-7-8-15-9-13(11)14/h1-4,7-9H,5-6H2
charge 0 multiplicity 1
27 atoms
O  -0.12297 2.284412 0.969617
N  -3.710034 0.924618 -0.420125
C  0.582015 -1.897828 -0.501534
C  -0.573972 -1.988188 0.527192
C  1.618315 -0.822068 -0.201892
C  -1.647182 -0.960543 0.23853
C  1.317359 0.490788 0.286545
C  -1.363833 0.433227 0.170502
C  -0.052734 1.096596 0.509815
C  2.979917 -1.170064 -0.407164
C  -2.980526 -1.370942 -0.011603
C  2.397878 1.382161 0.56597
C  -2.433282 1.317379 -0.163777
C  4.033075 -0.272216 -0.141226
C  3.73739 1.01732 0.358986
C  -3.968895 -0.416042 -0.32691
H  0.148104 -1.741529 -1.510546
H  1.102003 -2.872458 -0.538985
H  -0.164328 -1.860369 1.548158
H  -1.022309 -2.997047 0.484077
H  3.213159 -2.17595 -0.776579
H  -3.245455 -2.432427 0.042294
H  2.137662 2.376055 0.942725
H  -2.231709 2.391553 -0.218768
H  5.071214 -0.578314 -0.312022
H  4.541966 1.726155 0.580698
H  -5.005927 -0.71738 -0.513177
