program: Gaussian 09
title: 000086551
version: EM64L-G09RevD.01
frameworkgroup: C1[X(C22H24N2O5)]
method: RPBEPBE
basis: SDD
operation: Freq
keyword: #p
keyword: freq=noraman
keyword: PBEPBE/SDD
title: #p freq=noraman PBEPBE/SDD
converged: YES YES NO NO
title: Mulliken charges:
elementType: O O O O O N N C C C C C C C C C C C C C C C C C C C C C C H H H H H H H H H H H H H H H H H H H H H H H H
charge: -0.354912 -0.265933 -0.299480 -0.410351 -0.224064 -0.180979 -0.415453 -0.244940 -0.470249 -0.487885 -0.351525 0.268370 0.329036 -0.101493 -0.603173 0.170109 0.458991 -0.476072 -0.372220 -0.431993 0.495935 -0.235573 -0.231282 -0.245546 -0.374260 -0.399104 -0.229395 -0.226706 -0.233823 0.294728 0.224537 0.264494 0.229837 0.260627 0.246431 0.239215 0.384336 0.271073 0.257125 0.236832 0.232052 0.252186 0.240404 0.236381 0.384401 0.232816 0.231036 0.234992 0.273792 0.231107 0.228597 0.227013 0.229963
chargesum: 0.00000
title: Mulliken charges with hydrogens summed into heavy atoms:
elementType: O O O O O N N C C C C C C C C C C C C C C C C C C C C C C
charge: -0.354912 -0.265933 -0.299480 -0.025950 -0.224064 -0.180979 -0.031117 0.049788 0.018782 0.002578 0.134121 0.268370 0.329036 0.169580 -0.109217 0.170109 0.458991 0.008165 -0.131816 -0.195612 0.495935 -0.002758 -0.000246 -0.010554 -0.100468 -0.167997 -0.000797 0.000307 -0.003861
polarizability: 2.81216681e+02 -1.86847290e+01 2.38981146e+02 7.69462486e+00 1.30410839e+01 2.39572652e+02
1716.lowfreq: -8.1405 -4.5058 -0.0002 0.0005 0.0008 4.6342 5.2693 16.1023 24.2110
frequency: -7.0011 15.7863 24.1340 35.6146 36.6570 40.5219 50.7660 63.7463 65.8086 83.5024 97.1442 100.9493 115.5044 127.8281 137.7053 167.2264 174.1055 190.1512 211.5363 239.4391 247.1656 273.9024 297.9028 304.6016 330.9207 352.9599 358.0750 390.9245 401.3559 405.2651 421.9973 464.2783 482.6681 510.1665 527.1657 560.8085 563.6896 584.0465 601.2352 613.7633 617.3119 618.8222 653.1744 674.7287 680.9043 686.8331 700.9226 705.8944 716.2471 734.1731 740.9556 759.4573 795.4608 815.9776 835.0370 840.3526 854.9729 856.5173 860.9570 863.8023 875.3960 889.4328 916.5788 924.6381 935.3088 937.5577 963.1370 977.6219 978.6798 985.0838 990.0975 990.5487 999.0341 1002.7278 1013.8758 1027.0374 1027.3417 1043.1291 1072.0095 1085.6395 1088.9406 1089.9359 1095.8231 1128.2907 1144.9967 1173.2522 1173.7934 1174.0956 1178.2674 1189.5781 1192.8235 1207.7086 1210.4859 1222.8541 1233.9296 1237.7801 1243.5528 1262.7595 1271.9396 1306.2328 1308.2270 1311.4807 1323.4981 1328.4476 1330.6313 1333.6881 1341.0205 1342.4236 1352.3036 1370.0241 1383.3067 1384.9513 1438.2325 1442.0116 1451.1421 1456.2450 1458.6245 1477.3242 1484.7539 1486.9534 1493.7113 1502.7108 1591.9661 1593.9474 1609.8504 1614.3621 1614.7327 1648.5926 1659.7195 2985.7874 2998.9426 2999.8338 3018.3325 3030.7451 3037.8885 3042.1879 3043.3044 3062.6258 3096.6888 3111.3186 3113.7235 3114.6121 3118.1390 3127.3335 3128.2169 3137.8174 3139.3216 3149.1982 3150.2484 3164.3686 3166.3972 3403.5666 3521.8935
redmass: 5.2968 5.8799 5.3422 4.2180 4.3638 5.2351 7.1232 5.6072 4.9591 5.9151 9.5191 5.6219 3.8535 3.5091 5.2545 5.6291 3.2532 4.6639 3.9797 6.1762 4.1803 3.4548 4.6759 3.6630 4.1162 6.5668 2.5572 4.4468 2.8266 2.8343 3.5537 2.9773 4.7171 4.9101 5.2475 2.9635 2.0709 2.7635 2.7440 4.1316 6.1784 4.3894 3.4821 5.4523 3.5660 4.6722 2.1152 1.7903 1.5700 2.5327 1.7092 2.1286 4.7077 3.4706 3.9728 3.2473 1.2852 2.5137 1.3830 1.9227 4.0003 1.9317 2.2130 1.8489 2.2528 1.4896 1.8286 2.6110 1.4678 1.4182 5.8260 5.5805 1.3215 1.3329 3.2133 2.3675 2.2422 2.4214 1.7948 2.2284 1.7047 1.5434 1.8920 2.6676 3.1086 1.0543 1.3657 1.0663 1.7168 1.1208 1.1418 1.5185 2.0059 2.8240 1.2321 1.1683 1.6960 1.3440 1.6433 1.3376 1.4996 1.5991 2.1019 1.6631 1.2765 1.4451 1.5059 1.2691 1.3972 2.3643 5.2891 7.7819 1.9073 2.1494 1.0947 1.1480 1.1711 1.0968 2.2927 2.2407 1.0856 1.8959 5.8824 6.0829 6.0465 6.0018 6.0359 10.5829 8.9948 1.0605 1.0619 1.0837 1.0672 1.0623 1.0834 1.0584 1.0997 1.1016 1.1028 1.1029 1.1058 1.0882 1.0882 1.0871 1.0861 1.0912 1.0919 1.0958 1.0963 1.1016 1.1014 1.0816 1.0641
irintensity: 0.1853 0.1422 0.1837 0.2806 0.0266 0.6652 1.9193 0.9233 0.5259 0.6530 4.5430 1.4856 1.3309 5.4228 0.5438 1.5745 2.8104 2.0706 1.2119 8.8399 5.9721 4.1413 4.4383 1.7904 10.9223 4.4124 15.0528 4.1921 0.2024 0.1808 2.6119 11.3483 0.5064 10.0079 32.8365 23.4537 50.6756 15.7955 49.3466 30.6682 1.4421 21.0780 7.1224 8.6263 13.1186 49.6338 47.4391 44.4534 62.9091 29.9962 56.3232 57.7487 3.3382 12.2782 6.0113 10.5202 3.1404 16.3532 5.4527 14.9846 44.3638 37.4188 42.0500 19.8422 3.0497 0.8904 1.6583 95.4314 12.6881 5.2683 0.3893 1.1279 0.7490 0.4264 104.1877 4.1308 2.7248 32.9245 17.1155 136.9785 3.0990 17.0331 8.0625 6.0128 15.4077 0.0338 18.8492 0.7039 8.0464 1.7293 0.3893 2.0682 4.0714 32.8566 2.8065 12.4082 8.9511 5.7328 76.5785 0.5876 7.8538 25.0364 32.8215 71.3622 2.7267 14.6618 12.3911 27.3468 1.6214 150.3861 0.3211 2.0897 4.4353 8.5472 26.8184 22.4732 32.4595 28.6335 11.0524 18.6554 3.7467 242.7370 0.6528 3.8120 242.7772 1.6590 0.2477 382.9155 238.4419 12.4347 28.7149 8.7791 20.3933 28.6205 12.8064 20.8108 14.3992 18.7715 25.7953 16.1727 0.2489 7.3094 7.9087 1.8100 2.5643 9.9286 18.7422 32.4943 24.2828 25.2217 14.5985 223.5132 32.1670
temp: 298.150 k
press: 1.00000 atm
elementType: 8 8 8 8 8 7 7 6 6 6 6 6 6 6 6 6 6 6 6 6 6 6 6 6 6 6 6 6 6 1 1 1 1 1 1 1 1 1 1 1 1 1 1 1 1 1 1 1 1 1 1 1 1
symmnumber: 1
zpe: 1113381.3 jmol-1
zpe.correction: 0.424065 hartree
zpe.thermalcorrener: 0.450009 hartree
zpe.thermalcorrenthalpy: 0.450953 hartree
zpe.thermalcorrgfe: 0.365047 hartree
zpe.sumelectzpe: -1336.288610 hartree
zpe.sumelectthermal: -1336.262666 hartree
zpe.sumelectthermalent: -1336.261721 hartree
zpe.sumelectthermalfe: -1336.347628 hartree
dipole: -3.6055 0.9144 1.9257
dipole: 4.1886
quadrupole: -189.1575 -155.6156 -157.6300
quadrupole: 3.1588 -3.6015 2.7700
quadrupole: -21.6898 11.8521 9.8377 3.1588 -3.6015 2.7700
hfenergy: -1336.7126747 hartree
pointgroup: C01 [X(C22H24N2O5)]
dipole: 1.3478316 0.3560338 0.8787489 debye
polarizability: 283.3818167|14.7348976|245.2961105|5.868148|-13.4972179|231.0925523 unknown
InChI: InChI=1S/C22H24N2O5/c25-20(23-18(21(26)27)14-16-8-3-1-4-9-16)19-12-7-13-24(19)22(28)29-15-17-10-5-2-6-11-17/h1-6,8-11,18-19,23,26H,7,12-15H2
charge 0 multiplicity 1
53 atoms
O  0.515866 0.641259 0.288011
O  -3.932227 -0.393286 0.341615
O  0.635477 2.243147 -1.451953
O  -3.014033 -2.720272 2.236955
O  -4.042856 -3.935822 0.543941
N  -1.361594 1.836672 -0.304258
N  -1.739491 -1.137843 0.353704
C  -2.130288 1.253114 0.834638
C  -3.262405 2.281276 1.044122
C  -3.534586 2.818676 -0.385656
C  -2.134765 2.875001 -1.043831
C  -2.691607 -0.155427 0.486199
C  -0.033283 1.640958 -0.568622
C  -2.125851 -2.496661 -0.027742
C  -0.896823 -3.445283 -0.05425
C  -3.183302 -3.105395 0.904588
C  0.250173 -3.013702 -0.966773
C  2.005019 0.44473 0.160249
C  0.043622 -2.254832 -2.147291
C  1.571592 -3.426672 -0.652489
C  2.758831 1.326987 1.130496
C  1.127553 -1.91948 -2.989732
C  2.656699 -3.102021 -1.497558
C  2.437877 -2.343645 -2.670892
C  3.093956 2.660477 0.776632
C  3.13986 0.834666 2.404641
C  3.791031 3.485994 1.686065
C  3.838663 1.659118 3.3148
C  4.16518 2.987972 2.956654
H  -1.463912 1.156782 1.710412
H  -2.909064 3.089997 1.709031
H  -4.153227 1.807274 1.483725
H  -4.022178 3.807362 -0.383012
H  -4.186976 2.108892 -0.922044
H  -2.151791 2.648483 -2.123737
H  -1.644586 3.858381 -0.913443
H  -0.746621 -0.873139 0.425165
H  -2.616483 -2.489964 -1.020801
H  -1.265753 -4.438827 -0.376592
H  -0.519761 -3.567319 0.97904
H  2.137611 -0.62636 0.378962
H  2.273382 0.653891 -0.888578
H  -0.962651 -1.913397 -2.414764
H  1.749142 -4.015453 0.256612
H  -3.732561 -3.13789 2.78426
H  0.949028 -1.32414 -3.891834
H  3.667686 -3.437351 -1.239933
H  3.276693 -2.084552 -3.326155
H  2.794758 3.04125 -0.2066
H  2.88805 -0.196409 2.683124
H  4.046201 4.513695 1.404256
H  4.130294 1.268243 4.296105
H  4.708933 3.628347 3.660438
