program: Gaussian 09
title: 000091966
version: EM64L-G09RevD.01
frameworkgroup: C1[X(C5H8ClNOS)]
method: RPBEPBE
basis: SDD
operation: Freq
keyword: #p
keyword: freq=noraman
keyword: PBEPBE/SDD
title: #p freq=noraman PBEPBE/SDD
converged: YES YES NO NO
title: Mulliken charges:
elementType: Cl S O N C C C C C H H H H H H H H
charge: -0.050075 0.336950 -0.266559 0.008188 -0.202905 -0.170997 -0.651401 -0.584352 -0.374162 0.214371 0.218202 0.200759 0.220195 0.277224 0.292592 0.253847 0.278124
chargesum: 0.00000
title: Mulliken charges with hydrogens summed into heavy atoms:
elementType: Cl S O N C C C C C
charge: -0.050075 0.336950 -0.266559 0.008188 0.229668 0.249956 -0.081585 -0.052381 -0.374162
polarizability: 1.16929354e+02 -1.24878608e+01 9.06397836e+01 4.07282106e+00 -2.91696201e+00 5.49153567e+01
1716.lowfreq: -13.3977 -9.0821 -0.0013 0.0009 0.0023 1.7898 21.8522 24.8978 35.2644
frequency: 21.8333 24.7952 34.8220 82.1869 133.2288 151.1294 185.4020 273.3771 285.2453 381.1121 420.7669 450.8057 475.4378 600.4822 615.4045 626.2165 767.1417 879.9678 957.8935 958.6296 1004.0512 1015.2610 1074.5353 1103.8316 1161.3380 1183.2052 1212.1267 1231.3787 1283.5857 1300.1324 1341.8862 1402.9543 1430.6394 1433.5145 1455.6926 1473.3356 2098.9081 2917.7452 2927.7076 2989.8188 2992.5528 3060.9556 3064.9338 3145.5710 3147.6773
redmass: 16.3314 6.6309 4.5845 7.3819 7.7803 5.6071 2.3333 2.5524 2.5644 12.6993 8.1944 2.7756 3.6596 4.4154 4.9539 12.2926 2.1192 1.8009 2.0449 1.9360 1.6769 1.9111 2.0739 4.6217 1.1148 1.2064 1.2244 1.2343 1.1976 1.1938 1.2538 1.4217 1.1047 1.1103 1.0826 1.0802 12.7235 1.0606 1.0593 1.0998 1.1007 1.0579 1.0577 1.1095 1.1102
irintensity: 0.0798 1.0398 0.6169 4.5705 1.9171 12.7826 2.7814 1.6122 2.3411 0.0415 0.7772 11.1781 5.4657 4.7228 21.5337 1.2416 3.6411 0.2558 26.0484 8.7154 18.5875 48.1313 16.8858 110.7861 5.6733 2.8532 0.5329 1.6355 19.9712 26.2361 26.4521 0.6272 19.9260 9.1291 10.7394 9.0490 32.9725 47.1896 82.3531 60.2983 4.9199 10.4503 24.1960 5.4317 10.4835
temp: 298.150 k
press: 1.00000 atm
elementType: 17 16 8 7 6 6 6 6 6 1 1 1 1 1 1 1 1
symmnumber: 1
zpe: 327652.5 jmol-1
zpe.correction: 0.124796 hartree
zpe.thermalcorrener: 0.135912 hartree
zpe.thermalcorrenthalpy: 0.136856 hartree
zpe.thermalcorrgfe: 0.084012 hartree
zpe.sumelectzpe: -1182.662136 hartree
zpe.sumelectthermal: -1182.651021 hartree
zpe.sumelectthermalent: -1182.650076 hartree
zpe.sumelectthermalfe: -1182.702920 hartree
dipole: -4.5519 5.6166 0.4315
dipole: 7.2424
quadrupole: -86.0054 -64.1809 -67.0383
quadrupole: -0.1182 -1.3562 1.3080
quadrupole: -13.5972 8.2273 5.3699 -0.1182 -1.3562 1.3080
hfenergy: -1182.7869323 hartree
pointgroup: C01 [X(C5H8Cl1N1O1S1)]
dipole: 2.0043761 -2.0233176 -0.0871317 debye
dipolederiv: -0.2027909 0.0469914 0.0210448 -0.0296521 -0.5081092 -0.0398434 0.0214639 -0.0969108 -0.1929886 0.0138816 0.1584121 0.0439654 0.231144 0.0850754 -0.0098675 0.0212567 -0.0028606 0.052565 -1.2443908 -0.199654 0.0206514 -0.2014293 -0.4293423 -0.0188319 0.0026189 0.0168193 -0.4021772 -0.4770288 0.0686087 0.0360342 0.0102107 -0.2042061 -0.0036158 0.0486302 -0.0127891 -0.2084582 0.5938938 0.1597598 -0.1124634 0.4031581 0.3620563 0.015282 -0.164038 -0.082067 0.3348059 0.9029188 0.0833794 0.0815237 -0.0813835 0.1626254 0.0742902 0.2452294 0.075598 0.2981137 0.0053907 -0.2357135 -0.0220902 -0.378857 0.3656523 0.0658457 -0.0507305 0.0612748 0.1424148 0.1131394 -0.107356 -0.022082 -0.0594653 0.6649485 0.1253495 -0.0028282 0.1425611 0.1975116 0.4432386 -0.0931371 -0.0935826 -0.0985287 -0.1642451 0.0044491 -0.1021643 -0.0002417 -0.0447635 -0.0816862 0.1127321 0.0222405 -0.0293391 -0.2006887 -0.0164331 0.0180169 -0.0260527 0.0645976 0.0156271 -0.0300366 -0.0207641 -0.0818012 0.052825 -0.0487177 0.0470412 0.0372398 -0.1711438 -0.1194969 -0.0135598 -0.0016896 0.1575407 -0.1828772 -0.0384257 -0.0026544 -0.0473523 0.0664119 -0.0341928 -0.0295655 0.0460536 0.0193282 0.0829878 -0.016305 -0.0772044 0.004044 -0.1635628 -0.0273381 -0.0345915 0.0398579 -0.0131629 -0.0234334 0.0171572 0.0459632 0.0232982 0.0761785 0.082751 0.0432491 0.0082356 0.1047364 -0.0225919 -0.0412189 -0.014201 -0.046217 -0.0604805 -0.1119603 0.0370607 -0.023581 0.0350354 -0.0219756 -0.0257142 -0.0525798 -0.0209444 0.0902189 0.1280437 0.0334205 -0.0233541 0.0124656 -0.0187011 -0.0434005 0.0161803 -0.0253996 -0.0792433 unknown
polarizability: 118.7980076|-8.9305021|87.5992444|-7.1989867|5.928555|56.0872427 unknown
InChI: InChI=1S/C5H8ClNOS/c6-1-2-8-3-4-9-5-7/h1-4H2
charge 0 multiplicity 1
17 atoms
Cl 2.93512 2.020086 0.235871
S  -1.473299 0.678129 -0.014399
O  1.208846 -0.66333 -0.401387
N  -4.38523 0.548501 0.399357
C  0.222204 -1.545271 0.224944
C  2.542699 -0.7691 0.190777
C  -1.125849 -1.184732 -0.380317
C  3.416402 0.317965 -0.410717
C  -3.19815 0.569635 0.225572
H  0.452278 -2.612647 0.005578
H  0.213977 -1.402336 1.326516
H  2.988392 -1.761419 -0.053447
H  2.493906 -0.669206 1.295653
H  -1.943002 -1.767065 0.071274
H  -1.124952 -1.298224 -1.474473
H  4.471875 0.180373 -0.132201
H  3.300485 0.365241 -1.503301
