program: Gaussian 09
title: 000091905
version: EM64L-G09RevD.01
frameworkgroup: C1[X(C12H15NO2S)]
method: RPBEPBE
basis: SDD
operation: Freq
keyword: #p
keyword: freq=noraman
keyword: PBEPBE/SDD
title: #p freq=noraman PBEPBE/SDD
converged: YES YES NO NO
title: Mulliken charges:
elementType: S O O N C C C C C C C C C C C C H H H H H H H H H H H H H H H
charge: 0.096061 -0.244697 -0.261741 -0.109108 -0.364141 -0.369859 -0.286919 -0.294745 -0.002033 -0.857598 0.544657 -0.391376 -0.369102 -0.220935 -0.221968 -0.238683 0.237180 0.243087 0.260918 0.232986 0.201334 0.225610 0.226119 0.202372 0.312429 0.269971 0.230517 0.271855 0.224720 0.225441 0.227647
chargesum: 0.00000
title: Mulliken charges with hydrogens summed into heavy atoms:
elementType: S O O N C C C C C C C C C C C C
charge: 0.096061 -0.244697 -0.261741 -0.109108 0.116125 0.124045 0.140025 0.133747 -0.002033 -0.275197 0.544657 -0.160859 -0.097247 0.003785 0.003473 -0.011036
polarizability: 2.18051754e+02 6.51210720e+00 1.53002189e+02 8.26865250e+00 -3.64655380e-01 1.10182551e+02
1716.lowfreq: -11.6255 -5.0206 -0.9823 -0.0008 0.0020 0.0021 18.8014 27.1984 39.7826
frequency: 18.4300 27.1611 39.7645 50.1737 101.8695 112.8340 137.0394 188.0540 223.1517 276.6515 288.3820 332.6799 346.3299 397.1212 401.1164 403.7709 451.9617 459.9255 479.1679 552.9402 568.7673 611.8475 616.6880 628.5953 651.7334 703.9522 774.7884 790.8657 804.8085 830.1518 841.2165 856.5317 879.8541 918.2180 931.9968 982.1210 989.0914 998.9222 1001.7328 1010.0721 1027.1962 1050.6024 1069.8130 1079.8763 1101.4676 1169.4955 1174.8718 1178.0001 1186.0001 1189.7057 1194.7801 1221.6671 1245.0121 1259.2472 1273.7063 1329.1429 1329.9325 1343.7080 1351.9753 1364.7775 1384.2948 1389.6861 1438.4757 1443.2708 1447.3437 1450.3152 1455.4545 1458.7397 1483.5990 1592.4985 1612.5550 1613.8878 2957.8153 2961.8418 2988.1950 2990.7821 3036.4671 3081.7955 3087.7185 3090.3382 3094.1053 3114.6477 3116.8690 3125.3246 3137.7164 3148.4922 3162.8561
redmass: 6.1955 4.1022 4.1735 4.7279 7.2509 7.0380 4.1935 4.7463 2.7530 3.0293 3.9419 4.4099 2.0470 1.9709 5.7235 3.0204 5.1559 3.0950 5.0670 5.2000 2.5182 9.9001 6.2544 4.9130 3.2377 1.7226 2.0475 4.4476 4.1173 1.7953 3.4035 1.2539 1.7163 2.5124 1.4411 1.3829 5.8734 1.3288 2.6293 2.3952 2.2056 2.2459 3.5595 1.5682 2.1641 1.0738 1.0719 2.4968 1.6914 1.2541 1.0695 2.9444 1.1870 1.4809 1.1990 1.2379 1.2577 1.2265 1.3005 1.4407 8.0373 2.0744 1.2420 1.8656 1.0810 1.0818 1.0994 1.0979 2.3236 6.1081 7.4070 7.1098 1.0678 1.0679 1.0646 1.0652 1.0583 1.0967 1.0966 1.0979 1.0985 1.1038 1.0893 1.0871 1.0921 1.0963 1.1016
irintensity: 0.1308 0.3205 0.3667 0.9643 3.4740 3.1402 0.3072 5.5527 5.6167 13.8988 0.9524 17.6100 12.1559 1.0638 2.5875 0.3137 1.6778 0.3582 3.7997 19.2141 33.0094 15.9685 0.3390 61.4337 13.1074 62.1272 25.7400 27.9612 10.2889 2.1036 13.6601 0.5993 1.0188 7.8023 4.4246 0.5953 0.4293 1.0426 109.1189 8.0516 6.2640 34.7246 31.9909 11.5600 23.9590 0.1630 0.3243 36.0228 223.6099 56.8918 9.5001 9.1503 3.7901 56.3992 6.8806 3.7774 0.2808 5.5032 6.0671 8.0778 0.6444 91.0989 31.5155 11.0158 8.9430 7.9205 26.8033 4.3414 15.5059 6.1219 163.4776 117.6408 39.6121 61.0833 10.2692 69.0547 17.8731 12.8847 32.3025 36.6310 7.0970 0.3401 7.7091 1.6104 20.7337 25.2063 27.5314
temp: 298.150 k
press: 1.00000 atm
elementType: 16 8 8 7 6 6 6 6 6 6 6 6 6 6 6 6 1 1 1 1 1 1 1 1 1 1 1 1 1 1 1
symmnumber: 1
zpe: 656071.2 jmol-1
zpe.correction: 0.249884 hartree
zpe.thermalcorrener: 0.264991 hartree
zpe.thermalcorrenthalpy: 0.265935 hartree
zpe.thermalcorrgfe: 0.204774 hartree
zpe.sumelectzpe: -1068.336161 hartree
zpe.sumelectthermal: -1068.321055 hartree
zpe.sumelectthermalent: -1068.320110 hartree
zpe.sumelectthermalfe: -1068.381271 hartree
dipole: 0.4903 -0.6516 -0.7677
dipole: 1.1200
quadrupole: -100.6005 -94.7967 -103.1908
quadrupole: 2.3414 4.4605 -2.2934
quadrupole: -1.0712 4.7327 -3.6615 2.3414 4.4605 -2.2934
hfenergy: -1068.5860452 hartree
pointgroup: C01[X(C12H15N1O2S1)]
dipole: 0.1847182 -0.3998549 -0.0125752 debye
polarizability: 218.3094014|7.8996218|127.9374922|-3.1784484|-21.4947905|134.9896 unknown
InChI: InChI=1S/C12H15NO2S/c14-12(13-6-8-15-9-7-13)16-10-11-4-2-1-3-5-11/h1-5H,6-10H2
charge 0 multiplicity 1
31 atoms
S  0.081562 -0.754992 1.385325
O  5.017427 -0.609725 -0.488074
O  0.636104 1.609707 0.062314
N  2.199336 -0.091933 -0.25677
C  2.721551 -1.458705 -0.044549
C  3.040207 0.741618 -1.151915
C  4.182546 -1.380814 0.447346
C  4.489135 0.759665 -0.629594
C  1.041415 0.432826 0.276132
C  -1.418385 0.389692 1.730925
C  -2.573723 0.167002 0.786504
C  -3.619202 -0.735574 1.112658
C  -2.635069 0.874333 -0.44361
C  -4.702543 -0.932581 0.227424
C  -3.717492 0.677341 -1.328639
C  -4.754433 -0.226703 -0.997111
H  2.683826 -2.010718 -1.004698
H  2.101388 -1.99922 0.689304
H  2.611499 1.756384 -1.184585
H  3.016841 0.307071 -2.170958
H  4.214271 -0.915124 1.455908
H  4.635681 -2.384637 0.488664
H  5.159707 1.260896 -1.346307
H  4.532125 1.283488 0.349332
H  -1.000824 1.40617 1.644776
H  -1.673028 0.167525 2.779305
H  -3.583071 -1.284889 2.061865
H  -1.826809 1.570086 -0.695943
H  -5.504912 -1.63064 0.492216
H  -3.755501 1.230747 -2.273885
H  -5.59523 -0.377598 -1.683659
