program: Gaussian 09
title: 000091900
version: EM64L-G09RevD.01
frameworkgroup: C1[X(C7H15ClO2)]
method: RPBEPBE
basis: SDD
operation: Freq
keyword: #p
keyword: freq=noraman
keyword: PBEPBE/SDD
title: #p freq=noraman PBEPBE/SDD
converged: YES YES NO NO
title: Mulliken charges:
elementType: Cl O O C C C C C C C H H H H H H H H H H H H H H H
charge: -0.093273 -0.286510 -0.302288 0.372380 -0.405220 -0.365612 -0.760618 -0.597957 -0.538831 -0.528698 0.236948 0.214327 0.242761 0.236112 0.239158 0.239794 0.223463 0.258565 0.267114 0.218168 0.229202 0.226831 0.214983 0.232809 0.226394
chargesum: 0.00000
title: Mulliken charges with hydrogens summed into heavy atoms:
elementType: Cl O O C C C C C C C
charge: -0.093273 -0.286510 -0.302288 0.372380 0.046056 0.113261 -0.058203 -0.072278 0.135369 0.145487
polarizability: 1.03701173e+02 -4.83423107e+00 9.04966471e+01 -5.19289872e+00 2.82078833e+00 8.01221024e+01
1716.lowfreq: -13.6109 -6.3656 -0.0015 -0.0012 0.0019 5.8434 36.8451 61.5586 102.7941
frequency: 36.5880 61.4962 102.7628 107.9259 132.2716 146.4959 177.0947 190.4020 225.2595 237.9380 270.2166 282.1818 338.5304 367.8188 406.6428 420.2582 534.6097 580.3640 595.5163 687.6984 765.3010 791.8882 855.5251 923.3952 964.5330 987.5649 994.5247 1021.9137 1072.5209 1093.2883 1109.2066 1112.1920 1114.0484 1139.7802 1153.0133 1187.4935 1203.0774 1253.2854 1285.4321 1308.0557 1310.7968 1367.8023 1385.6802 1416.9843 1425.5435 1444.0807 1451.5460 1456.5176 1458.0278 1466.3692 1470.3839 1475.6840 1482.5540 1488.4038 2960.9018 2962.3955 2981.2827 3000.1613 3007.3832 3041.1033 3050.3650 3052.0370 3053.3096 3074.7982 3103.5131 3104.5958 3108.2342 3112.9816 3131.8962
redmass: 4.2240 4.1433 2.8366 2.9603 3.0721 1.3518 1.2977 1.5328 1.8200 1.6285 1.7222 2.7152 2.6963 3.5218 3.3703 3.4243 3.3081 3.7975 4.3315 3.4828 2.0372 1.6941 1.7962 2.0781 1.8466 5.7653 2.7789 3.3260 1.5246 1.7679 1.2972 1.9942 1.2655 1.3758 1.4299 1.8122 1.4215 1.9717 1.5888 1.2631 1.3133 1.5352 1.2664 1.1226 1.1362 1.0723 1.1009 1.0553 1.0796 1.0549 1.0666 1.0540 1.0507 1.0505 1.0318 1.0320 1.0613 1.0601 1.0359 1.0839 1.1020 1.0720 1.1006 1.1019 1.1009 1.1008 1.0998 1.1001 1.1112
irintensity: 1.4617 2.1200 1.9583 2.6350 5.4553 0.2434 2.6155 7.8779 2.0220 1.6125 3.4074 7.5640 3.5002 8.3520 6.5527 9.7651 3.9850 1.4771 25.0498 7.4103 23.2184 63.2268 10.2901 3.7330 0.2999 116.8270 22.6155 58.9605 13.8975 59.5716 0.8858 8.0467 0.0495 10.6299 7.3553 45.4494 21.6177 38.9851 22.9103 4.4975 28.8234 5.4928 41.1906 4.0238 5.1620 1.6405 7.1057 11.5770 8.4445 9.5556 3.7900 17.4673 7.1789 6.0509 95.4478 24.0022 7.4013 26.0889 6.7744 5.6759 40.0065 26.1963 51.2843 27.4853 31.5565 33.7197 9.9115 24.8831 20.4635
temp: 298.150 k
press: 1.00000 atm
elementType: 17 8 8 6 6 6 6 6 6 6 1 1 1 1 1 1 1 1 1 1 1 1 1 1 1
symmnumber: 1
zpe: 556762.6 jmol-1
zpe.correction: 0.212060 hartree
zpe.thermalcorrener: 0.225165 hartree
zpe.thermalcorrenthalpy: 0.226109 hartree
zpe.thermalcorrgfe: 0.172048 hartree
zpe.sumelectzpe: -885.382113 hartree
zpe.sumelectthermal: -885.369008 hartree
zpe.sumelectthermalent: -885.368064 hartree
zpe.sumelectthermalfe: -885.422125 hartree
dipole: 2.0101 -1.4300 -1.3040
dipole: 2.7903
quadrupole: -74.0875 -65.5296 -68.7445
quadrupole: 2.1772 0.8214 -2.7966
quadrupole: -4.6336 3.9243 0.7093 2.1772 0.8214 -2.7966
hfenergy: -885.5941731 hartree
pointgroup: C01 [X(C7H15Cl1O2)]
dipole: -0.7450051 -0.6450973 0.4837277 debye
dipolederiv: -0.4521283 -0.148926 0.055029 -0.2298798 -0.3709429 0.0793782 0.1297961 0.1172216 -0.2613721 -0.6243074 0.2670601 0.0990798 0.1210763 -1.0034592 -0.1437868 0.1242552 -0.1617221 -0.5308685 -0.8639316 -0.2856633 0.1615064 -0.1997074 -0.7943972 0.06485 0.1785331 0.22985 -0.5273103 0.890863 -0.1557804 -0.1852703 0.0618094 1.1763217 0.0153783 -0.2337461 -0.288214 0.6619774 -0.1808967 0.0250501 -0.0367547 -0.0065201 -0.0593777 -0.02201 -0.0814982 0.0172376 0.0465351 -0.1054404 -0.0315586 -0.0255446 -0.2034929 -0.0200109 0.0255255 0.0140838 0.048436 0.0670468 -0.0477869 -0.0052818 -0.0222857 -0.0321645 -0.0779796 -0.1023559 0.0318217 -0.06651 -0.2274284 0.4933821 0.2567073 -0.1379577 0.3533584 0.440234 -0.1542416 -0.1563768 -0.1467071 0.301383 0.2819109 0.0336982 -0.0212758 -0.0053513 0.4526908 0.0967536 -0.1092678 0.2773095 0.3359512 0.5198616 0.2278417 -0.079382 0.120441 0.3814034 0.0307813 0.0305532 0.0853881 0.2274116 0.0523972 -0.0451829 0.0298473 -0.0161017 -0.02086 0.0721293 0.0307836 0.0846854 0.0158044 0.0731385 0.0082481 -0.0145827 0.0103152 0.0270346 -0.0726011 0.0018752 -0.0980923 -0.1118186 0.0706289 -0.0918564 0.0453967 -0.0301836 -0.0198341 0.0727816 -0.0257786 0.0628312 0.0489184 0.0602317 0.0267702 0.0129618 0.0522475 0.0438138 -0.0606305 0.0053551 -0.1005733 -0.1027095 0.0456184 -0.0609289 0.1016728 -0.0687915 0.0355065 0.08539 0.0907358 0.0601791 0.0102504 -0.116619 -0.0306938 -0.0918529 -0.010568 0.0993509 -0.0145831 -0.0559557 -0.0129354 0.0873424 0.0711158 0.0927834 0.0072673 0.0972597 -0.102126 -0.0135344 0.0017352 0.0156774 0.0700717 0.0422084 -0.0371639 0.0761491 -0.0755645 0.0040323 -0.043585 0.0244623 -0.0202617 -0.114899 -0.0878659 0.0503553 0.0083963 0.0643345 -0.0862456 0.0671145 0.0198451 0.0442496 0.0696506 -0.0867171 -0.1741197 -0.037014 -0.101022 -0.0465432 -0.05379 0.0176564 -0.0827413 0.0220848 0.0873389 -0.0315207 0.0092853 -0.0278901 0.0214981 0.1107777 0.0529664 0.007774 -0.1224565 -0.0711858 0.1503695 -0.0111211 0.1144375 -0.0201248 -0.021997 -0.0367298 -0.0004719 0.085432 -0.0042989 -0.0297758 0.0242935 -0.0533532 -0.0838463 -0.1188813 -0.0583418 -0.1828198 -0.0389403 -0.0893276 0.0424086 -0.0142923 0.1332769 -0.0232504 0.0266372 -0.086718 0.0052102 0.0789405 0.04181 -0.0528402 0.0464484 -0.0679656 0.0471119 0.0744996 0.0899547 0.104999 -0.090997 unknown
polarizability: 102.8735942|5.9746093|91.5714987|-4.8221684|-2.5991038|79.8748295 unknown
InChI: InChI=1S/C7H15ClO2/c1-7(9-2,10-3)5-4-6-8/h4-6H2,1-3H3
charge 0 multiplicity 1
25 atoms
Cl 3.90807 0.789302 -0.209535
O  -1.658358 1.188278 -0.486968
O  -1.297857 -0.868989 0.730696
C  -0.794898 0.001325 -0.350258
C  0.633272 0.373191 0.097647
C  1.600207 -0.828738 0.129412
C  -0.867616 -0.660871 -1.733823
C  2.943408 -0.518083 0.78314
C  -1.740994 2.054521 0.698692
C  -2.650073 -1.40733 0.525277
H  1.020598 1.154842 -0.580653
H  0.575839 0.807171 1.113984
H  1.128433 -1.642044 0.718618
H  1.775136 -1.221366 -0.889117
H  -0.307486 -0.056702 -2.466911
H  -1.914669 -0.719317 -2.073128
H  -0.438599 -1.676362 -1.705112
H  2.837532 -0.08275 1.789133
H  3.612833 -1.391045 0.80821
H  -0.841386 2.691602 0.801185
H  -1.881568 1.457757 1.619774
H  -2.620354 2.696343 0.530206
H  -2.660498 -2.197036 -0.251165
H  -3.359582 -0.606556 0.244186
H  -2.940986 -1.845842 1.493011
