program: Gaussian 09
title: 000091969
version: EM64L-G09RevD.01
frameworkgroup: C1[X(C16H18S2)]
method: RPBEPBE
basis: SDD
operation: Freq
keyword: #pfreq=noraman
keyword: PBEPBE/SDD
title: #p freq=noraman PBEPBE/SDD
converged: YES YES NO NO
title: Mulliken charges:
elementType: S S C C C C C C C C C C C C C C C C H H H H H H H H H H H H H H H H H H
charge: 0.037581 0.024545 0.358905 0.340850 0.358366 0.368963 -0.408131 -0.396018 -0.425896 -0.425600 -0.209784 -0.199587 -0.814092 -0.795330 -0.819761 -0.806689 -0.234671 -0.227474 0.233509 0.233819 0.263122 0.259826 0.258603 0.243499 0.224290 0.253598 0.220555 0.239578 0.231659 0.228220 0.234298 0.228601 0.228174 0.228579 0.232518 0.231373
chargesum: 0.00000
title: Mulliken charges with hydrogens summed into heavy atoms:
elementType: S S C C C C C C C C C C C C C C C C
charge: 0.037581 0.024545 0.358905 0.340850 0.358366 0.368963 -0.408131 -0.396018 -0.192387 -0.191780 0.053338 0.060239 -0.087699 -0.081598 -0.125584 -0.121335 -0.002153 0.003899
polarizability: 2.78569549e+02 9.56178768e+00 2.14897855e+02 -1.87003325e+01 4.72262584e+00 1.58330758e+02
1716.lowfreq: -48.4353 -12.4027 -4.8965 -2.2234 -0.0022 -0.0006 0.0026 12.9148 29.8541
frequency: -48.1523 10.2903 28.8010 33.2824 62.8678 73.7123 106.0461 116.2561 144.0735 157.7171 162.9107 212.5884 229.1558 245.6735 254.3907 258.3101 279.7935 326.5074 330.3344 361.4728 377.7146 381.5537 447.1206 449.4993 502.3891 504.9049 507.2086 510.7217 534.4039 536.9169 602.5573 603.1159 716.9642 719.0039 785.9214 787.9766 788.9814 790.9135 822.3728 824.1446 914.4962 917.0432 979.2427 980.0124 987.6273 989.0790 999.2757 1001.4200 1024.7146 1026.7338 1052.7491 1053.5006 1080.2772 1081.1824 1138.1925 1139.5556 1180.5156 1181.1949 1207.0399 1208.4782 1255.8620 1256.2510 1359.2481 1360.2032 1389.5997 1391.9673 1402.4321 1403.4509 1410.6096 1412.6257 1440.4722 1441.6765 1458.6221 1460.8527 1465.0384 1466.9436 1475.7633 1476.4391 1479.7646 1481.6554 1569.2694 1570.4035 1591.2932 1594.0910 2970.9558 2972.3993 2973.4236 2974.2664 3042.9917 3047.2634 3047.7933 3055.4646 3084.3026 3084.3326 3097.3393 3105.8281 3120.9736 3122.1213 3143.4599 3144.7222 3165.7521 3166.8967
redmass: 1.1761 4.8088 3.5456 3.7871 4.2938 4.0505 1.6642 1.5336 3.8285 1.0864 1.0953 3.2587 3.2792 4.7024 5.6042 3.2830 4.2058 2.7102 2.5112 10.0190 8.5841 10.4366 3.1196 3.2241 3.8324 3.8476 3.6301 3.5727 4.0338 4.0553 5.4990 5.4967 2.5337 2.6017 3.2636 2.5540 1.7979 1.6621 3.8944 3.9013 1.3375 1.3288 1.3467 1.3404 1.4335 1.4508 1.8512 1.8414 1.4418 1.4356 1.6476 1.6398 2.0523 2.0362 2.0528 2.0426 1.6486 1.6855 2.0516 2.0436 1.8728 1.8799 6.7851 7.0345 1.2363 1.2322 1.2286 1.2222 2.0671 2.0760 2.4866 2.9015 1.1436 1.0604 1.1870 1.1522 1.0943 1.0836 1.0609 1.0711 6.1179 6.1951 6.0326 6.0051 1.0374 1.0380 1.0394 1.0406 1.0968 1.0968 1.0963 1.0929 1.0986 1.0987 1.0987 1.0964 1.0875 1.0877 1.0917 1.0914 1.0984 1.0987
irintensity: 0.6098 0.1532 0.1189 0.2130 0.4298 0.2947 0.0726 0.2385 0.7589 1.0866 1.8533 0.5844 0.9039 1.3836 2.6760 2.3656 11.8731 0.6332 0.5652 0.4399 3.9776 2.3606 1.1026 2.7268 2.8240 1.6484 3.0212 1.2717 2.7146 2.2332 0.4373 1.8321 14.6113 13.9816 2.7283 25.9144 11.7697 47.1169 0.5494 0.7151 0.1380 0.7290 0.0339 0.0556 7.4595 8.2276 4.7354 5.3023 10.6650 9.0942 1.6437 0.4755 11.5485 5.7607 3.7448 3.4419 0.3758 1.1981 15.3410 7.4586 1.0080 0.5165 0.8598 0.4341 3.5764 9.1173 29.6547 25.9747 4.4575 2.7690 10.0793 13.0141 19.3833 4.7058 13.0255 16.7451 17.7708 18.8531 17.4351 24.2938 1.4683 0.5951 3.6147 3.3702 40.7263 47.2269 10.3695 8.7688 35.0713 0.5692 28.3780 16.9220 22.2672 22.4541 3.9385 5.7536 10.7777 11.3464 17.2668 18.6761 14.3198 20.8418
temp: 298.150 k
press: 1.00000 atm
elementType: 16 16 6 6 6 6 6 6 6 6 6 6 6 6 6 6 6 6 1 1 1 1 1 1 1 1 1 1 1 1 1 1 1 1 1 1
symmnumber: 1
zpe: 757629.3 jmol-1
zpe.correction: 0.288566 hartree
zpe.thermalcorrener: 0.307317 hartree
zpe.thermalcorrenthalpy: 0.308261 hartree
zpe.thermalcorrgfe: 0.239328 hartree
zpe.sumelectzpe: -1415.329908 hartree
zpe.sumelectthermal: -1415.311157 hartree
zpe.sumelectthermalent: -1415.310213 hartree
zpe.sumelectthermalfe: -1415.379145 hartree
dipole: 0.3210 3.6197 -0.4599
dipole: 3.6628
quadrupole: -108.1037 -119.4260 -122.1318
quadrupole: 0.2663 -7.5472 0.3100
quadrupole: 8.4501 -2.8722 -5.5780 0.2663 -7.5472 0.3100
hfenergy: -1415.6184737 hartree
pointgroup: C01 [X(C16H18S2)]
dipole: -0.0430842 -1.4126854 -0.2813509 debye
polarizability: 276.549378|11.6088333|216.3624353|22.0250535|0.5948942|158.8863484 unknown
InChI: InChI=1S/C16H18S2/c1-11-7-5-9-15(13(11)3)17-18-16-10-6-8-12(2)14(16)4/h5-10H,1-4H3
charge 0 multiplicity 1
36 atoms
S  -0.851546 2.251644 1.107021
S  0.574397 2.359131 -0.746152
C  -2.730263 0.463939 -0.109536
C  1.958228 -0.141674 -0.660456
C  -3.354601 -0.819218 -0.205929
C  3.081065 -0.943216 -0.274531
C  -1.699731 0.641119 0.863051
C  1.934944 1.226066 -0.249663
C  -2.952206 -1.863847 0.664158
C  4.123055 -0.372184 0.494884
C  -1.304443 -0.415231 1.723576
C  2.988719 1.783179 0.520551
C  -3.143137 1.583482 -1.043642
C  0.850087 -0.766984 -1.485323
C  -4.448445 -1.074608 -1.229496
C  3.158293 -2.403155 -0.686291
C  -1.940045 -1.669221 1.630411
C  4.085222 0.98376 0.893269
H  -3.441419 -2.841955 0.580708
H  4.975624 -0.998697 0.783678
H  -0.502679 -0.240428 2.447529
H  2.932677 2.83536 0.815568
H  -2.834978 2.563419 -0.645048
H  -2.662825 1.468645 -2.035657
H  -4.234844 1.592623 -1.208438
H  0.086888 -0.022522 -1.757438
H  1.250898 -1.21576 -2.414286
H  0.347951 -1.578975 -0.924851
H  -4.118137 -0.820262 -2.253934
H  -4.755152 -2.134348 -1.224391
H  -5.348917 -0.463975 -1.024066
H  3.17015 -2.515368 -1.787585
H  4.069508 -2.880637 -0.287957
H  2.285171 -2.976166 -0.320166
H  -1.644897 -2.486837 2.296924
H  4.901886 1.410102 1.485607
