program: Gaussian 09
title: 000091892
version: EM64L-G09RevD.01
frameworkgroup: C1[X(C11H17NO)]
method: RPBEPBE
basis: SDD
operation: Freq
keyword: #p
keyword: freq=noraman
keyword: PBEPBE/SDD
title: #p freq=noraman PBEPBE/SDD
converged: YES YES NO NO
title: Mulliken charges:
elementType: O N C C C C C C C C C C C H H H H H H H H H H H H H H H H H
charge: -0.268925 -0.571931 0.272087 -0.619751 -0.719171 -0.724999 0.499272 -0.372813 -0.404802 -0.372449 -0.372047 0.318404 -0.537691 0.192467 0.238749 0.236588 0.205949 0.197874 0.233288 0.199553 0.228796 0.257045 0.252936 0.238082 0.226895 0.247519 0.236695 0.243839 0.219456 0.219085
chargesum: 0.00000
title: Mulliken charges with hydrogens summed into heavy atoms:
elementType: O N C C C C C C C C C C C
charge: -0.268925 -0.061950 0.272087 -0.188535 -0.078759 -0.063362 0.499272 -0.134731 -0.177906 -0.124931 -0.135351 0.318404 0.144689
polarizability: 1.80949106e+02 -3.23016490e+00 1.21753295e+02 1.06449499e+01 3.57174138e+00 8.83162879e+01
1716.lowfreq: -20.7649 -2.3024 -0.0006 -0.0003 0.0005 3.4184 40.4061 55.3201 75.8828
frequency: 40.3164 54.9475 75.7968 106.7499 176.8461 200.4951 229.8563 233.6097 236.7853 277.5303 279.0562 302.3231 337.5353 363.4869 379.1631 416.3494 427.3493 441.2285 468.5606 514.9287 560.1632 634.1740 657.1448 697.4862 742.8534 750.9080 811.3257 824.9283 843.8915 885.7029 913.2264 921.2425 938.6493 960.3923 966.0954 989.1390 1002.7616 1004.2405 1051.5415 1102.2618 1111.7714 1132.4134 1155.5818 1178.0600 1192.5957 1218.5662 1228.8087 1248.5840 1296.2334 1305.1409 1331.0880 1371.5571 1381.9967 1389.6659 1415.8271 1435.9139 1455.9427 1464.8924 1465.4066 1466.9927 1472.4171 1480.5847 1483.8363 1501.2855 1582.1695 1623.2446 1631.6397 2955.8526 2961.5888 2966.0354 2977.3546 3042.1112 3042.4654 3056.8218 3066.6285 3071.2038 3097.4008 3119.2822 3122.1023 3128.5446 3157.7653 3164.7235 3406.7060 3533.7323
redmass: 3.1479 3.6785 3.3399 3.5872 2.9014 2.3822 1.2260 1.2498 1.2696 1.0518 2.2902 2.4463 4.0662 2.2361 2.4001 2.9519 2.0396 3.0693 2.8775 3.0841 3.2718 6.5176 1.5142 3.6008 4.1479 3.7333 1.5460 1.9922 2.2079 1.8345 1.8956 1.4228 1.4489 1.6441 1.4316 8.2507 1.3825 2.5993 1.4256 1.3717 1.2604 1.3190 1.3343 1.2580 2.0683 2.1682 4.7783 2.0919 1.8333 1.3025 1.8650 1.2532 4.3309 1.2322 3.2598 1.1700 1.0549 1.0835 1.0504 1.0575 1.0736 1.0659 1.0617 2.4831 6.9600 6.4595 1.0980 1.0331 1.0378 1.0602 1.0383 1.1038 1.0973 1.0992 1.0975 1.0982 1.1001 1.0896 1.0983 1.0890 1.0937 1.0955 1.0444 1.0961
irintensity: 0.4897 1.0511 0.1277 4.6315 1.2246 2.6837 18.3750 3.6889 0.4055 9.5104 15.2698 20.7452 1.5764 1.5659 0.3435 0.0989 15.6478 3.8184 1.3961 24.0951 16.3851 1.5817 201.5001 3.5319 8.4866 6.3188 24.4498 5.7090 42.3753 0.5322 2.0252 0.5469 0.0698 0.3960 0.1060 40.9463 3.0844 6.8949 1.6118 6.0297 0.2319 22.1818 0.8641 63.9997 19.8907 29.2545 152.0791 31.3710 22.2065 0.3990 0.7503 24.4165 16.0655 16.6248 1.9339 9.6548 1.7258 1.2553 12.7286 0.0657 55.5082 15.5851 17.8083 113.3321 8.3297 41.0738 40.7072 69.5039 28.5306 48.4596 20.9375 49.5154 14.5970 35.8723 17.5016 78.2986 30.7728 29.7176 15.1670 15.5477 17.4485 5.0404 5.4887 0.6761
temp: 298.150 k
press: 1.00000 atm
elementType: 8 7 6 6 6 6 6 6 6 6 6 6 6 1 1 1 1 1 1 1 1 1 1 1 1 1 1 1 1 1
symmnumber: 1
zpe: 674176.9 jmol-1
zpe.correction: 0.256780 hartree
zpe.thermalcorrener: 0.270859 hartree
zpe.thermalcorrenthalpy: 0.271803 hartree
zpe.thermalcorrgfe: 0.216414 hartree
zpe.sumelectzpe: -558.321414 hartree
zpe.sumelectthermal: -558.307335 hartree
zpe.sumelectthermalent: -558.306391 hartree
zpe.sumelectthermalfe: -558.361780 hartree
dipole: 0.2539 -2.6030 0.6873
dipole: 2.7042
quadrupole: -69.3517 -75.3250 -82.7406
quadrupole: -2.4098 -1.5527 1.7284
quadrupole: 6.4541 0.4807 -6.9349 -2.4098 -1.5527 1.7284
hfenergy: -558.5781941 hartree
pointgroup: C01 [X(C11H17N1O1)]
dipole: -0.0886165 1.0375613 0.2180166 debye
polarizability: 180.7795539|-4.3879989|121.3821137|-10.896427|-5.1388143|88.8570208 unknown
InChI: InChI=1S/C11H17NO/c1-11(2,12)8-9-4-6-10(13-3)7-5-9/h4-7H,8,12H2,1-3H3
charge 0 multiplicity 1
30 atoms
O  -3.733829 -0.36511 0.406067
N  4.230814 0.112007 -0.414645
C  2.870304 0.141533 0.200553
C  1.866376 -0.04301 -0.992414
C  2.594829 1.474624 0.953247
C  2.790558 -1.044689 1.187443
C  0.390397 -0.092408 -0.631669
C  -0.244009 -1.323814 -0.305333
C  -0.409376 1.076397 -0.617524
C  -1.607484 -1.383738 0.03508
C  -1.782268 1.041679 -0.278347
C  -2.382368 -0.19725 0.053985
C  -4.575819 0.831925 0.43251
H  2.043812 0.792008 -1.702209
H  2.171234 -0.971113 -1.510749
H  1.583117 1.495128 1.397347
H  3.330782 1.610401 1.768707
H  2.684624 2.337595 0.264825
H  1.795112 -1.105284 1.659109
H  3.541511 -0.927606 1.993139
H  2.998528 -1.992869 0.661093
H  4.98171 0.113828 0.287992
H  4.373445 0.865266 -1.100707
H  0.34146 -2.250604 -0.328426
H  0.045796 2.038743 -0.882958
H  -2.094733 -2.332069 0.282045
H  -2.362841 1.969317 -0.284558
H  -5.572533 0.476347 0.732869
H  -4.635215 1.30649 -0.566726
H  -4.205636 1.570477 1.170657
