program: Gaussian 09
title: 000091951
version: EM64L-G09RevD.01
frameworkgroup: C1[X(C20H22O7)]
method: RPBEPBE
basis: SDD
operation: Freq
keyword: #pfreq=noraman
keyword: PBEPBE/SDD
title: #p freq=noraman PBEPBE/SDD
converged: YES YES NO NO
title: Mulliken charges:
elementType: O O O O O O O C C C C C C C C C C C C C C C C C C C C H H H H H H H H H H H H H H H H H H H H H H
charge: -0.270434 -0.268059 -0.295179 -0.349963 -0.227813 -0.408131 -0.395718 -0.015914 0.017448 -0.252430 -0.252817 -0.703678 -0.713214 0.259819 0.201798 0.051227 0.125422 0.160884 0.171575 -0.310841 -0.308872 -0.338290 -0.393075 -0.255481 -0.231038 -0.196878 -0.206708 0.236078 0.246266 0.193484 0.235024 0.182956 0.204188 0.227778 0.263846 0.207429 0.211367 0.265696 0.218419 0.270868 0.277896 0.257619 0.219268 0.239051 0.243594 0.233146 0.230730 0.385516 0.356142
chargesum: 0.00000
title: Mulliken charges with hydrogens summed into heavy atoms:
elementType: O O O O O O O C C C C C C C C C C C C C C C C C C C C
charge: -0.270434 -0.268059 -0.295179 -0.349963 -0.227813 -0.022615 -0.039576 0.220164 0.263715 0.176078 0.134328 -0.004625 -0.017732 0.259819 0.201798 0.051227 0.125422 0.160884 0.171575 -0.039973 -0.030976 -0.080671 -0.173807 -0.016429 0.012556 0.036267 0.024022
polarizability: 2.58945342e+02 -1.33050615e+01 3.11708330e+02 3.94403251e+01 5.60589155e+00 1.60502611e+02
1716.lowfreq: -8.7211 -3.6729 -1.8303 -0.0006 -0.0005 0.0005 8.2091 17.3144 20.4483
frequency: 5.5667 17.2075 20.4452 24.3529 42.2886 47.0989 59.7252 81.4180 93.0708 101.2638 104.9290 131.4935 140.8146 152.7634 158.3552 189.6651 207.8887 208.8622 218.9927 233.4353 249.3696 254.2001 261.4517 282.6430 303.6663 368.3025 375.2783 386.3212 390.5035 406.5937 430.9785 432.9273 438.5884 455.9569 471.8035 493.6025 500.5826 519.5693 529.5474 549.9687 555.8101 627.4837 649.2253 654.8891 675.3483 679.6471 753.8418 757.0799 763.1112 768.9522 775.4717 777.0676 786.8329 788.9928 840.5941 846.7870 853.0574 861.6818 874.3518 891.5642 903.9113 928.6861 931.8531 949.0849 953.0031 967.8255 986.9618 993.5853 1017.5369 1024.9654 1040.0426 1041.7980 1058.6483 1069.1542 1078.9395 1098.2075 1104.9954 1121.9459 1126.6095 1154.8453 1158.9174 1165.9079 1169.2387 1175.2397 1215.4240 1222.8697 1225.9266 1231.6308 1252.1548 1252.9666 1280.5280 1293.6799 1295.3931 1326.0641 1338.2561 1340.3791 1355.0911 1379.7452 1387.5333 1391.5024 1392.4384 1405.8986 1410.2270 1429.2553 1430.0181 1456.2231 1460.3625 1465.1697 1468.1084 1474.5857 1480.7226 1482.1983 1489.9547 1548.7667 1581.7607 1594.6295 1607.4949 1632.1627 1641.2233 2918.5399 2929.5091 2982.3127 2990.4461 2991.5533 3001.4916 3003.6501 3035.7656 3040.4417 3086.3068 3097.3065 3109.1135 3112.9503 3125.4033 3135.1586 3143.3068 3153.6309 3161.2607 3171.2502 3178.4980 3179.5446 3560.8709
redmass: 5.2986 5.7104 5.9504 6.0427 5.7570 7.9249 5.5277 4.3980 5.4175 4.5679 3.6454 3.6120 3.9122 4.9283 4.1253 2.0935 1.2797 1.1748 4.3799 4.4408 4.6407 4.6484 5.0887 4.4550 4.8785 3.4872 1.6557 2.6376 3.1510 3.9472 4.0925 3.4860 5.2782 3.4673 4.0753 4.2745 3.3332 3.3727 4.0390 7.2704 6.0676 3.4155 6.1625 6.4070 4.8499 4.7987 2.8106 3.8820 1.6578 4.8147 1.4223 6.1594 4.9880 4.0304 5.2420 4.2026 1.6461 1.1897 1.3208 3.4344 1.9787 1.5889 1.8110 1.6774 1.3700 1.3608 1.3328 1.3143 7.0146 2.2671 2.3018 2.5398 4.1098 2.7400 2.2997 2.0921 1.9997 2.2795 1.7452 1.7245 1.2888 1.7266 1.1985 1.0621 1.2022 1.4967 1.7042 1.6776 2.8005 2.9253 2.0280 1.3755 1.4472 1.7567 1.3568 1.3132 1.3257 2.6664 1.2723 1.3166 6.1897 2.7817 1.6940 2.8547 2.3648 1.0794 1.0516 1.0702 2.4271 1.0856 1.0605 1.0558 2.5632 4.5984 4.6269 6.7175 6.6785 10.6778 5.0780 1.0607 1.0571 1.1028 1.0972 1.0386 1.0668 1.0387 1.0854 1.0864 1.0989 1.0985 1.0997 1.0886 1.1007 1.0868 1.0902 1.0904 1.0934 1.0952 1.0985 1.0989 1.0659
irintensity: 0.2631 1.3205 0.6099 0.8768 0.4331 2.8898 0.4577 4.2749 1.7282 1.4432 0.3710 3.4466 5.2890 0.4988 1.5181 1.1023 0.5916 0.1401 0.9001 6.7923 0.4121 3.3069 1.8844 7.5679 3.2716 1.3264 78.2072 41.4004 19.9683 14.9105 3.2592 1.4793 4.8832 6.6675 14.0517 15.8901 4.8969 12.8375 9.7797 2.4556 6.0999 6.2114 9.9567 9.2757 13.7129 19.2294 70.7444 3.6440 70.8402 17.3114 64.4380 3.1418 1.2107 7.8144 32.0423 10.1443 10.4705 99.9031 15.5684 26.8835 6.0571 0.7307 17.8004 0.8022 2.6163 1.7683 2.6161 1.2342 307.8529 24.9901 29.6596 75.8852 203.6317 53.1897 70.2778 153.8075 21.5388 21.3148 38.1442 29.9756 33.8366 20.4866 23.4895 11.6604 142.4777 196.7505 71.1942 149.9854 13.1235 135.1057 215.3946 1.0067 65.4272 24.7260 1.9917 6.2008 12.2257 143.5116 15.4403 34.8605 20.1867 79.7912 19.4346 6.5794 38.7542 8.4198 11.4872 18.3935 101.0557 17.8503 12.6331 12.5509 25.4257 46.9808 80.7185 16.2685 31.2357 240.5899 133.4592 41.8882 98.3953 50.8408 42.5780 26.8225 278.6118 12.3951 17.9802 11.1764 37.0767 26.0502 12.4397 14.4933 14.6860 6.0022 12.2236 7.0001 10.9228 11.8821 2.7799 15.0372 34.0235
temp: 298.150 k
press: 1.00000 atm
elementType: 8 8 8 8 8 8 8 6 6 6 6 6 6 6 6 6 6 6 6 6 6 6 6 6 6 6 6 1 1 1 1 1 1 1 1 1 1 1 1 1 1 1 1 1 1 1 1 1 1
symmnumber: 1
zpe: 1005424.4 jmol-1
zpe.correction: 0.382946 hartree
zpe.thermalcorrener: 0.409476 hartree
zpe.thermalcorrenthalpy: 0.410420 hartree
zpe.thermalcorrgfe: 0.321725 hartree
zpe.sumelectzpe: -1299.904702 hartree
zpe.sumelectthermal: -1299.878172 hartree
zpe.sumelectthermalent: -1299.877228 hartree
zpe.sumelectthermalfe: -1299.965923 hartree
dipole: 0.9994 0.9011 -0.0797
dipole: 1.3480
quadrupole: -173.2423 -116.7919 -161.0003
quadrupole: 10.9055 -10.5001 5.1166
quadrupole: -22.8975 33.5529 -10.6555 10.9055 -10.5001 5.1166
hfenergy: -1300.2876479 hartree
pointgroup: C01 [X(C20H22O7)]
dipole: -0.1792291 -0.476739 -0.1478448 debye
polarizability: 312.3911311|15.7874695|217.7232911|-11.2221245|60.5970315|201.0418607 unknown
InChI: InChI=1S/C20H22O7/c1-13(26-19(23)15-7-3-5-9-17(15)21)11-25-12-14(2)27-20(24)16-8-4-6-10-18(16)22/h3-10,13-14,21-22H,11-12H2,1-2H3
charge 0 multiplicity 1
49 atoms
O  2.931676 0.7404 0.030685
O  0.584376 2.61426 -0.023525
O  2.113896 -2.031738 -0.086258
O  0.325961 3.603653 2.070223
O  2.461205 -3.087699 -2.139556
O  -2.002143 3.619147 3.193587
O  0.386411 -4.995593 -2.476313
C  2.041346 3.008786 -0.012155
C  3.544192 -1.596942 -0.081754
C  2.847986 1.982596 0.79353
C  3.584313 -0.335796 0.776367
C  2.449223 3.117241 -1.480299
C  4.419768 -2.729928 0.472318
C  -0.171016 2.96414 1.074346
C  1.680159 -2.742836 -1.222718
C  -1.58197 2.557557 1.004676
C  0.206662 -2.965805 -1.156024
C  -2.450269 2.917604 2.094044
C  -0.419569 -4.061847 -1.819944
C  -2.108215 1.827389 -0.098164
C  -0.613641 -2.044285 -0.45081
C  -3.818992 2.54804 2.049787
C  -1.828915 -4.210549 -1.77471
C  -3.463837 1.464388 -0.131663
C  -2.014606 -2.186753 -0.410088
C  -4.315801 1.83202 0.947356
C  -2.62133 -3.276841 -1.077323
H  2.108135 3.979486 0.513812
H  3.829345 -1.359577 -1.123223
H  3.866316 2.398968 0.972707
H  2.368715 1.812581 1.78038
H  4.644172 -0.07192 0.992415
H  3.061415 -0.516393 1.740735
H  1.829333 3.868252 -1.997681
H  2.339299 2.142947 -1.98103
H  3.507866 3.42591 -1.551196
H  5.484248 -2.431216 0.473438
H  4.316308 -3.625355 -0.161578
H  4.124694 -2.989882 1.504639
H  -1.431322 1.559054 -0.914889
H  -0.124013 -1.208253 0.056287
H  -4.460458 2.836351 2.887291
H  -2.300525 -5.061825 -2.283464
H  -3.863351 0.90941 -0.986234
H  -2.622491 -1.457428 0.134005
H  -5.375787 1.554867 0.922448
H  -3.709215 -3.40409 -1.053065
H  -1.004486 3.800846 3.064617
H  -0.169069 -5.709141 -2.88073
