program: Gaussian 09
title: 000091895
version: EM64L-G09RevD.01
frameworkgroup: C1[X(C13H23NO)]
method: RPBEPBE
basis: SDD
operation: Freq
keyword: #p
keyword: freq=noraman
keyword: PBEPBE/SDD
title: #p freq=noraman PBEPBE/SDD
converged: YES YES NO NO
title: Mulliken charges:
elementType: O N C C C C C C C C C C C C C H H H H H H H H H H H H H H H H H H H H H H H
charge: -0.271436 -0.021959 -0.015917 -0.395429 -0.431390 -0.491028 -0.743657 -0.284262 -0.304448 0.373160 -0.215919 -0.785746 -0.794982 -0.437460 -0.120049 0.214727 0.197084 0.200350 0.216232 0.225218 0.213556 0.203460 0.211468 0.214647 0.212954 0.206471 0.185264 0.215171 0.198389 0.199355 0.225847 0.216716 0.214416 0.219304 0.230511 0.219134 0.263931 0.236316
chargesum: 0.00000
title: Mulliken charges with hydrogens summed into heavy atoms:
elementType: O N C C C C C C C C C C C C C
charge: -0.271436 -0.021959 0.198810 0.002006 0.010060 -0.074012 -0.104587 0.107473 -0.089277 0.373160 0.181824 -0.128767 -0.126033 0.062787 -0.120049
polarizability: 1.87158931e+02 -7.88521775e+00 1.35121297e+02 -7.47121860e+00 1.08397667e+01 1.28405066e+02
1716.lowfreq: -6.2875 -0.0007 -0.0003 0.0003 3.5056 9.9653 14.4780 21.3191 28.4384
frequency: 14.0948 20.8693 28.2788 32.8113 66.9830 79.4370 93.9924 105.9829 135.6762 140.5505 145.3464 169.5092 197.7288 207.8540 221.3386 244.0118 288.9469 325.8133 358.0398 367.6904 369.6649 386.6484 433.2604 449.3313 460.2359 504.0027 545.8564 580.7554 728.7446 779.9913 798.0844 824.2640 829.7448 845.9207 864.3279 904.5645 946.6254 955.3081 964.7279 969.6154 990.2452 995.8723 1021.5868 1037.3348 1052.3412 1078.9714 1081.2658 1082.0599 1097.4233 1110.7087 1133.3204 1145.6604 1171.8539 1191.5123 1198.3538 1228.4007 1241.3824 1246.3593 1280.9975 1286.5058 1303.3928 1315.4685 1328.2523 1338.7671 1345.9057 1350.9764 1362.6408 1388.3770 1389.6289 1398.1081 1402.2234 1433.0546 1454.0954 1455.3316 1462.2127 1465.4863 1472.1812 1473.8113 1476.1687 1477.2548 1485.0937 1490.1023 1492.8184 1692.1420 2205.1568 2912.2359 2928.7465 2952.2451 2955.6478 2960.5627 2963.0041 2967.4180 2975.5393 2979.4896 2984.3278 2987.1692 3010.2581 3017.6957 3026.7395 3030.7840 3039.0001 3050.3806 3062.6368 3066.8023 3068.6099 3071.5104 3078.7461 3092.5626
redmass: 5.3459 3.8056 3.1672 5.7439 2.8461 2.8624 3.7521 2.1291 3.8041 1.0696 2.5331 1.5834 1.5281 1.9708 1.6140 2.4196 3.1789 2.4681 2.6652 2.5167 3.1180 2.3949 2.7659 2.2193 2.9443 2.3734 2.6025 3.3107 1.9914 2.0186 1.4208 2.1047 2.9188 1.5539 1.7847 2.0116 1.3894 1.2929 1.7707 3.3658 1.7115 1.2498 2.5236 1.9060 2.3555 3.7976 2.6988 1.7119 1.8012 2.1779 2.1366 1.9245 1.3101 1.2162 1.5120 1.4391 1.1835 1.5482 1.1474 1.2815 1.1814 1.3483 1.4215 1.3233 1.4401 1.3878 1.4276 1.3287 1.2082 1.2335 1.4187 1.0899 1.0785 1.0564 1.0613 1.0789 1.0607 1.0650 1.0643 1.0779 1.0510 1.0834 1.0812 6.4154 12.4376 1.0586 1.0566 1.0665 1.0374 1.0732 1.0397 1.0405 1.0952 1.1038 1.0630 1.0621 1.0617 1.0977 1.0969 1.0964 1.0988 1.1022 1.0991 1.0989 1.1005 1.0939 1.0948 1.0960
irintensity: 2.8591 2.2575 1.6831 2.4533 1.5115 0.9560 0.9698 2.0738 5.8013 0.5736 2.1719 1.4726 0.3889 0.8782 0.1701 2.0947 1.0346 0.7694 0.5470 5.3388 0.6584 1.3129 3.6647 2.4369 1.9977 3.0718 1.0229 5.9628 9.8702 3.0129 0.4177 10.3430 0.6037 12.9946 6.7739 0.8014 1.0058 1.4499 6.9653 18.1784 8.2251 7.0512 28.4256 5.3181 48.2331 92.9899 29.9542 4.7664 4.4817 7.9199 7.9468 3.0382 0.2458 5.2086 2.9792 3.4410 5.0432 4.8607 4.2605 1.2640 0.3822 0.1124 7.2807 7.3695 6.6791 41.3843 1.1362 28.8753 16.6174 9.6191 1.2653 19.5136 3.4875 4.1552 5.7506 6.4003 23.2241 13.2384 2.0461 10.7074 23.2292 8.9277 0.4937 6.3260 9.3358 36.7227 96.5195 15.1090 40.6433 32.7000 53.5857 26.5792 71.8154 29.3884 6.2671 35.9917 17.6523 46.0499 10.8153 46.8937 36.7033 39.1959 63.6315 51.7146 6.7166 10.7440 70.5816 34.6811
temp: 298.150 k
press: 1.00000 atm
elementType: 8 7 6 6 6 6 6 6 6 6 6 6 6 6 6 1 1 1 1 1 1 1 1 1 1 1 1 1 1 1 1 1 1 1 1 1 1 1
symmnumber: 1
zpe: 871476.8 jmol-1
zpe.correction: 0.331928 hartree
zpe.thermalcorrener: 0.351048 hartree
zpe.thermalcorrenthalpy: 0.351992 hartree
zpe.thermalcorrgfe: 0.280882 hartree
zpe.sumelectzpe: -637.897968 hartree
zpe.sumelectthermal: -637.878848 hartree
zpe.sumelectthermalent: -637.877904 hartree
zpe.sumelectthermalfe: -637.949014 hartree
dipole: 2.6601 -1.5026 -4.1122
dipole: 5.1229
quadrupole: -106.2303 -90.3786 -96.4740
quadrupole: 11.2607 20.3739 1.1817
quadrupole: -8.5360 7.3157 1.2203 11.2607 20.3739 1.1817
hfenergy: -638.2298959 hartree
pointgroup: C01 [X(C13H23N1O1)]
dipole: 1.0726797 0.6515312 1.577068 debye
polarizability: 187.4212885|8.1401428|135.9171632|6.2958843|10.3887186|127.3468434 unknown
InChI: InChI=1S/C13H23NO/c1-12(2)6-4-7-13(3)8-11-15-10-5-9-14/h6,13H,4-5,7-8,10-11H2,1-3H3
charge 0 multiplicity 1
38 atoms
O  -2.507827 0.440403 0.280363
N  -5.833712 -0.201572 -1.487446
C  0.881896 -1.321916 0.563226
C  1.959861 -1.590931 -0.523148
C  -0.389256 -0.677836 -0.051632
C  2.487191 -0.339214 -1.287492
C  0.558288 -2.639466 1.31094
C  -1.475895 -0.347865 0.976698
C  3.081471 0.724036 -0.381929
C  4.402313 0.969275 -0.137842
C  -3.635251 0.785149 1.138276
C  4.829349 2.080016 0.810076
C  5.551272 0.193176 -0.758727
C  -4.687781 1.470443 0.244631
C  -5.314004 0.546976 -0.717685
H  1.311533 -0.607532 1.297656
H  1.547808 -2.312074 -1.26102
H  2.823467 -2.088594 -0.037366
H  -0.815103 -1.351484 -0.821393
H  -0.126673 0.267085 -0.563656
H  1.658136 0.106419 -1.872029
H  3.232989 -0.68086 -2.029371
H  0.062233 -3.362828 0.634763
H  1.484116 -3.112132 1.688565
H  -0.107432 -2.47659 2.178428
H  -1.938425 -1.266696 1.397048
H  -1.05278 0.246136 1.819785
H  2.349847 1.360934 0.140192
H  -4.060451 -0.121117 1.621797
H  -3.320935 1.493539 1.937032
H  3.961148 2.612573 1.236215
H  5.46654 2.823555 0.290417
H  5.433564 1.678777 1.648588
H  6.165266 -0.288662 0.028352
H  5.216306 -0.594416 -1.452921
H  6.228061 0.873725 -1.313066
H  -4.197804 2.291158 -0.310936
H  -5.479225 1.916708 0.876211
