program: Gaussian 09
title: 000091885
version: EM64L-G09RevD.01
frameworkgroup: C1[X(C16H29NO)]
method: RPBEPBE
basis: SDD
operation: Freq
keyword: #p
keyword: freq=noraman
keyword: PBEPBE/SDD
title: #p freq=noraman PBEPBE/SDD
converged: YES YES NO NO
title: Mulliken charges:
elementType: O N C C C C C C C C C C C C C C C C H H H H H H H H H H H H H H H H H H H H H H H H H H H H H
charge: -0.262895 -0.382283 0.271141 -0.496546 -0.480541 -0.046202 -0.406877 -0.411147 0.121371 -0.062098 -0.393487 -0.420726 -0.432043 -0.517171 -0.435261 -0.441730 -0.748333 -0.747667 0.241682 0.183407 0.215341 0.168700 0.177893 0.234240 0.186327 0.190300 0.227948 0.266782 0.195661 0.188972 0.197552 0.202793 0.203463 0.250535 0.228056 0.220836 0.295002 0.217466 0.222402 0.213220 0.224058 0.223838 0.203108 0.252870 0.216597 0.213556 0.229893
chargesum: 0.00000
title: Mulliken charges with hydrogens summed into heavy atoms:
elementType: O N C C C C C C C C C C C C C C C C
charge: -0.262895 -0.087282 0.271141 -0.071458 -0.096500 0.131692 0.013690 0.007101 0.121371 0.204683 -0.008854 -0.020380 0.021954 -0.068280 0.004606 -0.004452 -0.068517 -0.087620
polarizability: 1.92015258e+02 6.46860497e-02 1.73825017e+02 3.43892707e+00 -6.82936576e-01 1.58040357e+02
1716.lowfreq: -23.8980 -11.9882 -3.5526 0.0003 0.0004 0.0005 12.5942 38.4373 46.3569
frequency: -17.5667 38.2622 46.0453 52.6298 67.2658 88.3836 97.5105 112.8693 159.9406 165.5590 194.7489 206.6652 221.5133 229.4450 235.0958 267.5218 301.6811 328.1597 343.5541 356.0140 368.9205 399.2452 416.5650 443.6340 490.8557 508.8777 515.3431 518.7433 570.8892 628.0777 675.5486 701.5782 722.5516 750.0064 780.6778 799.5654 812.6906 846.8714 854.0152 867.9867 874.6827 880.5711 892.3014 900.4429 914.7803 915.2729 948.1217 950.7131 958.2409 978.8074 1007.7807 1019.5103 1025.7308 1037.0955 1049.5860 1064.7030 1065.6736 1082.8213 1109.4406 1128.6145 1147.9903 1149.0353 1162.4804 1173.8639 1178.8343 1186.0526 1197.4927 1200.9612 1210.4747 1221.1853 1232.1017 1250.7255 1258.1932 1275.7509 1285.2660 1290.2937 1299.9768 1307.7033 1310.7972 1316.9501 1318.5705 1329.1328 1336.6986 1338.1154 1349.7212 1350.8008 1356.9212 1365.0370 1381.1716 1397.2607 1451.2113 1454.6701 1463.4126 1464.1385 1466.8877 1470.3033 1472.1591 1473.7375 1474.1573 1477.4916 1484.1416 1485.6181 1489.4909 1490.6621 1494.3168 1583.8145 2938.5101 2945.0803 2955.9863 2965.9313 2977.4081 2977.6408 2980.5221 2981.8173 2986.8775 2992.0269 3000.1035 3003.5171 3005.2182 3013.6170 3020.6831 3021.6800 3036.7310 3042.8997 3045.5811 3048.1563 3059.0359 3063.3837 3066.3311 3071.0695 3075.7390 3078.3336 3081.9393 3088.3260 3544.6043
redmass: 3.2025 2.3878 3.3897 2.6735 2.7871 2.7721 2.7854 2.6103 2.4340 2.8350 2.5419 1.1856 3.0792 1.0865 2.5675 2.6149 3.0490 2.5083 2.2144 3.2760 2.8424 2.5046 2.3936 2.3700 2.7778 1.6824 2.0549 1.4688 2.7436 2.8227 2.5335 3.4571 1.8741 1.6823 1.9125 2.0560 2.1375 1.8672 2.3608 2.4396 2.8160 2.2345 2.9774 2.0550 1.5822 1.4168 1.9421 1.8057 1.5803 2.3460 1.8179 1.6159 2.0205 1.7446 2.4768 2.0764 1.9422 1.4105 1.9990 2.0478 2.1000 1.8894 2.0484 1.8685 1.5639 1.5226 1.3876 1.4643 1.4023 1.5705 1.4274 1.3256 1.4574 1.1865 1.2852 1.2319 1.2591 1.4030 1.4291 1.4821 1.4505 1.3781 1.3020 1.3876 1.3232 1.4006 1.3830 1.3756 1.2014 1.2025 1.0953 1.6078 1.0929 1.0847 1.0624 1.0822 1.0739 1.0886 1.1132 1.0996 1.0741 1.0791 1.0645 1.0599 1.1096 7.0328 1.0712 1.0791 1.0606 1.0626 1.0441 1.0540 1.0411 1.0628 1.0633 1.0606 1.0652 1.0612 1.0963 1.0660 1.0934 1.0987 1.1002 1.0998 1.0969 1.0880 1.0984 1.1028 1.0980 1.0985 1.1011 1.0998 1.0989 1.1020 1.0769
irintensity: 0.1062 0.7139 1.7539 2.0922 2.6697 1.6785 0.5959 0.7422 1.4315 1.1653 1.3725 0.1720 2.1410 0.0811 0.3168 3.4779 5.4431 0.0639 0.1436 3.6054 2.4860 0.8602 1.4120 1.8571 1.3498 39.0224 2.1843 42.9273 4.2049 2.3944 4.9846 3.8418 1.7492 9.2441 6.9410 2.8120 1.1422 3.4957 2.7414 5.6209 2.6075 4.9838 6.2389 5.1084 2.2876 3.0383 9.6479 2.3336 0.3022 2.6441 1.3679 2.0287 0.7143 5.4169 2.7529 1.4929 2.7466 2.9485 5.9181 1.8756 0.9093 0.6364 12.1657 12.1987 3.5993 3.6422 3.9041 0.1448 18.2623 25.1918 3.7213 8.0484 11.7356 2.7644 4.4742 6.5236 0.5444 0.7286 2.8821 3.0315 1.8462 0.3349 1.5466 2.3663 1.6078 1.8066 0.7324 3.6020 22.2532 22.2317 1.9941 215.3263 10.8530 13.1375 12.3257 58.1714 2.2809 7.4291 42.3900 14.6847 13.9766 15.4589 1.5339 19.1749 4.0291 119.6451 20.6030 56.3633 17.7802 59.2323 9.9210 43.5152 23.7625 71.0191 21.1506 15.6623 34.3839 57.9757 41.9192 29.9256 36.6743 62.0756 56.3271 13.9423 61.2626 15.4186 24.6264 3.1421 21.9712 62.9697 56.5737 23.4158 49.8529 81.7458 6.7411
temp: 298.150 k
press: 1.00000 atm
elementType: 8 7 6 6 6 6 6 6 6 6 6 6 6 6 6 6 6 6 1 1 1 1 1 1 1 1 1 1 1 1 1 1 1 1 1 1 1 1 1 1 1 1 1 1 1 1 1
symmnumber: 1
zpe: 1112137.8 jmol-1
zpe.correction: 0.423591 hartree
zpe.thermalcorrener: 0.442410 hartree
zpe.thermalcorrenthalpy: 0.443354 hartree
zpe.thermalcorrgfe: 0.376920 hartree
zpe.sumelectzpe: -755.632507 hartree
zpe.sumelectthermal: -755.613688 hartree
zpe.sumelectthermalent: -755.612744 hartree
zpe.sumelectthermalfe: -755.679178 hartree
dipole: -1.3140 0.2931 -3.3642
dipole: 3.6236
quadrupole: -104.9066 -111.9262 -119.4175
quadrupole: -0.3868 -0.0985 -1.5229
quadrupole: 7.1769 0.1572 -7.3340 -0.3868 -0.0985 -1.5229
hfenergy: -756.0560977 hartree
pointgroup: C01 [X(C16H29N1O1)]
dipole: -0.5574459 0.0690511 -1.3103117 debye
polarizability: 192.0071811|1.6796912|173.9836535|2.6566526|-0.405067|157.8897979 unknown
InChI: InChI=1S/C16H29NO/c1-13(2)16(11-7-3-4-8-12-16)15(18)17-14-9-5-6-10-14/h13-14,17H,3-12H2,1-2H3
charge 0 multiplicity 1
47 atoms
O  -0.091045 0.308114 1.993888
N  -1.329277 0.479536 0.053957
C  1.158614 0.667806 -0.143141
C  2.405711 0.453098 0.76341
C  1.133142 -0.308893 -1.369678
C  1.105271 2.16865 -0.673254
C  2.747463 -0.997613 1.194635
C  0.890926 -1.805166 -1.033311
C  -0.122161 0.455834 0.730006
C  -2.62753 0.306606 0.743606
C  3.275418 -1.899117 0.049398
C  2.179512 -2.630672 -0.772332
C  -2.932681 -1.187057 1.042999
C  -3.791493 0.705484 -0.196466
C  -3.422567 -1.76327 -0.315177
C  -4.057418 -0.552603 -1.085852
C  1.066937 3.209914 0.473144
C  2.237406 2.525933 -1.668734
H  2.2558 1.047981 1.681651
H  3.292696 0.865947 0.242128
H  2.090546 -0.213225 -1.916413
H  0.356073 0.037743 -2.085225
H  0.14782 2.262737 -1.231799
H  1.873949 -1.458207 1.692768
H  3.533904 -0.921345 1.971942
H  0.340231 -2.282551 -1.868649
H  0.222931 -1.87736 -0.153832
H  -2.589967 0.903001 1.671578
H  3.963029 -2.664202 0.461881
H  3.894132 -1.273472 -0.626869
H  2.617502 -2.946848 -1.74093
H  1.888875 -3.561886 -0.246004
H  -3.737541 -1.23563 1.80179
H  -2.053505 -1.708072 1.45622
H  -3.571804 1.616922 -0.782354
H  -4.678683 0.924548 0.425001
H  -1.329883 0.562544 -0.963863
H  -4.142145 -2.588841 -0.174537
H  -2.567538 -2.173987 -0.883247
H  -3.597491 -0.441104 -2.085741
H  -5.139676 -0.695047 -1.253083
H  2.037742 3.264279 0.998502
H  0.852624 4.21543 0.065505
H  0.292985 2.97057 1.223673
H  3.235128 2.44365 -1.200357
H  2.118193 3.573535 -2.003627
H  2.227545 1.887504 -2.569407
