program: Gaussian 09
title: 000091870
version: EM64L-G09RevD.01
frameworkgroup: C1[X(C15H24O2)]
method: RPBEPBE
basis: SDD
operation: Freq
keyword: #pfreq=noraman
keyword: PBEPBE/SDD
title: #p freq=noraman PBEPBE/SDD
converged: YES YES NO NO
title: Mulliken charges:
elementType: O O C C C C C C C C C C C C C C C H H H H H H H H H H H H H H H H H H H H H H H H
charge: -0.439246 -0.441369 0.169003 -0.414992 -0.393103 0.619320 -0.366095 -0.787333 -0.722187 -0.357213 -0.660919 -0.646192 -0.357039 0.331063 0.360203 -0.696631 -0.525869 0.190657 0.196078 0.199496 0.218110 0.187234 0.185933 0.225697 0.214201 0.221198 0.215724 0.224219 0.208588 0.187001 0.192000 0.240452 0.219165 0.194690 0.194123 0.214897 0.209401 0.211215 0.274899 0.351539 0.352079
chargesum: 0.00000
title: Mulliken charges with hydrogens summed into heavy atoms:
elementType: O O C C C C C C C C C C C C C C C
charge: -0.087707 -0.089290 0.169003 -0.028257 0.024504 0.619320 0.007073 -0.126238 -0.073655 0.021788 -0.420467 -0.427027 0.031774 0.331063 0.360203 -0.061117 -0.250970
polarizability: 1.67938422e+02 1.62915633e+01 1.70308858e+02 -1.08432909e+01 4.15024956e+00 1.68461697e+02
1716.lowfreq: -8.1092 -0.0003 -0.0002 0.0005 2.4762 10.9698 20.8955 23.3171 33.4510
frequency: 20.7714 23.0652 33.4218 63.6122 75.1420 105.3286 121.1301 150.3499 174.7224 182.0528 212.9985 221.4986 232.0364 232.4599 243.4679 269.1240 292.4237 304.1009 319.4914 344.6421 348.2872 349.7189 373.1458 399.5571 447.8203 485.5554 501.9409 515.8582 543.6066 559.6442 596.2376 627.1480 691.4221 720.7935 734.6610 780.1704 806.2395 830.6519 834.6685 859.4512 870.4326 886.5445 911.8020 929.1564 942.2946 965.6814 977.2604 983.5404 995.3408 1012.5247 1039.7383 1068.7257 1075.4991 1082.2909 1107.8431 1111.9186 1127.6938 1158.4421 1160.6812 1191.2466 1198.7462 1201.7885 1225.2367 1234.0341 1257.2861 1281.3710 1283.0881 1285.3737 1295.2981 1296.9983 1323.5484 1329.4758 1348.7719 1349.9638 1374.7691 1388.4804 1392.9145 1397.5415 1428.9324 1456.5900 1460.6322 1464.2354 1469.0175 1470.7312 1473.9397 1476.7960 1481.3493 1483.4295 1487.5463 1494.6533 1516.4981 1610.3814 1630.6068 2947.3732 2954.2495 2956.3852 2965.8968 2971.5562 2971.9010 2973.2934 2977.5284 2985.5408 2999.0628 3004.9672 3026.7183 3043.6711 3065.3908 3068.7067 3070.5778 3070.6515 3076.8305 3079.9422 3118.3617 3138.4447 3193.3704 3582.6947 3583.7006
redmass: 4.9571 4.6782 1.5528 3.3800 3.3524 1.6521 2.7067 2.5436 3.5286 3.3712 4.0612 3.3939 2.6744 1.2291 1.0894 3.2298 2.9013 1.1400 2.6016 1.1331 1.1633 3.2739 3.0547 2.8519 2.7690 3.3549 5.6627 4.0594 3.8230 3.8683 4.2951 3.5972 1.7606 1.0677 1.1175 1.2955 3.0106 1.4584 1.6764 1.7731 1.3331 1.9558 2.2606 1.7075 1.7370 2.9813 1.4760 6.0321 1.5505 2.5828 2.7691 2.3495 1.5152 2.0685 1.8726 1.5491 1.6140 1.4909 2.1222 1.7283 1.3784 2.5826 1.7244 1.4252 1.4632 1.3390 1.0681 1.2404 1.2561 1.2521 1.5158 2.9951 1.5144 1.6676 1.2095 1.2158 1.3213 4.8815 3.4826 1.0733 1.0691 1.0741 1.0660 1.0635 1.0748 1.0425 1.0807 1.0559 1.0865 1.0620 2.7278 6.8832 6.2888 1.0588 1.0588 1.0587 1.0591 1.0448 1.0378 1.0474 1.0366 1.0969 1.0985 1.1019 1.1043 1.1045 1.0997 1.1007 1.0991 1.0992 1.0997 1.0987 1.0898 1.0903 1.0934 1.0660 1.0659
irintensity: 0.2449 0.1031 0.0153 0.0833 0.0469 0.0046 0.0109 0.0916 0.1072 0.9290 7.2200 1.9310 0.0372 0.0095 0.0332 1.0901 1.3055 0.1504 0.5535 267.9798 0.5690 3.2784 0.9481 0.7022 1.4712 2.9375 19.2458 0.5058 10.4784 3.1537 0.0506 0.0036 34.2838 11.9565 0.3510 4.0424 1.9189 0.2251 18.9552 53.2249 0.6321 9.7812 10.7523 7.3010 5.8360 121.3187 14.9721 3.7545 1.6164 2.3426 7.7147 0.7367 2.4250 1.2923 51.6428 142.8833 32.7884 80.6349 12.9415 0.4665 20.4221 10.1359 2.4344 4.0520 0.6044 1.4718 0.4906 1.2075 9.5000 57.2443 5.3383 57.3717 3.6025 1.5527 10.6139 10.5446 16.2097 16.5983 107.8444 1.0532 0.3805 0.3775 1.2864 5.7293 3.0231 12.2969 4.9513 6.8896 18.3541 18.0858 14.2950 139.6397 149.3765 2.9995 6.1353 23.1330 48.0292 22.4982 22.7437 115.0717 28.6767 2.0884 6.7561 5.5449 6.7193 112.2291 2.8162 77.8542 129.2143 26.7584 31.1438 44.6544 16.1420 7.6510 0.1420 48.0065 15.3826
temp: 298.150 k
press: 1.00000 atm
elementType: 8 8 6 6 6 6 6 6 6 6 6 6 6 6 6 6 6 1 1 1 1 1 1 1 1 1 1 1 1 1 1 1 1 1 1 1 1 1 1 1 1
symmnumber: 1
zpe: 932632.1 jmol-1
zpe.correction: 0.355221 hartree
zpe.thermalcorrener: 0.374869 hartree
zpe.thermalcorrenthalpy: 0.375813 hartree
zpe.thermalcorrgfe: 0.306073 hartree
zpe.sumelectzpe: -735.102121 hartree
zpe.sumelectthermal: -735.082473 hartree
zpe.sumelectthermalent: -735.081529 hartree
zpe.sumelectthermalfe: -735.151269 hartree
dipole: 1.8154 2.9825 -0.0952
dipole: 3.4928
quadrupole: -116.4697 -111.6555 -93.2463
quadrupole: -7.6028 -3.3816 3.1332
quadrupole: -9.3459 -4.5317 13.8776 -7.6028 -3.3816 3.1332
hfenergy: -735.457342 hartree
pointgroup: C01 [X(C15H24O2)]
dipole: 0.7510258 1.1507736 -0.0089217 debye
polarizability: 168.7108011|16.7371623|168.9753491|-10.1574652|4.2932963|169.0228266 unknown
InChI: InChI=1S/C15H24O2/c1-4-5-6-7-8-15(2,3)12-9-13(16)11-14(17)10-12/h9-11,16-17H,4-8H2,1-3H3
charge 0 multiplicity 1
41 atoms
O  -2.45222 -2.123176 -2.309536
O  -3.371672 -1.518722 2.346184
C  -0.567172 1.958282 -0.044254
C  0.874914 1.688602 -0.59913
C  1.737109 0.69789 0.21411
C  -1.378832 0.641032 0.005525
C  3.100563 0.410733 -0.455885
C  -0.462042 2.644874 1.342606
C  -1.284273 2.950169 -1.011007
C  3.976402 -0.578392 0.345501
C  -1.996268 0.177612 1.192024
C  -1.529763 -0.130351 -1.177608
C  5.337658 -0.873995 -0.324898
C  -2.279169 -1.329553 -1.159601
C  -2.743988 -1.027798 1.185899
C  6.201864 -1.869966 0.47833
C  -2.896209 -1.795902 0.018193
H  0.795781 1.314149 -1.640482
H  1.399114 2.665068 -0.665075
H  1.915664 1.096344 1.233096
H  1.184259 -0.254349 0.339359
H  3.654233 1.363895 -0.592407
H  2.928778 0.003248 -1.474639
H  0.007822 1.993851 2.100912
H  -1.456048 2.951614 1.717894
H  0.156145 3.557261 1.255287
H  -1.362913 2.536799 -2.032664
H  -2.307753 3.173222 -0.658053
H  -0.722013 3.901425 -1.070857
H  4.151535 -0.172737 1.364125
H  3.422114 -1.530444 0.482266
H  -1.901205 0.745009 2.124343
H  -1.062478 0.20036 -2.113967
H  5.161626 -1.274456 -1.344372
H  5.892935 0.077329 -0.456869
H  7.169975 -2.061947 -0.020108
H  6.41479 -1.481778 1.492398
H  5.683037 -2.840366 0.594024
H  -3.473845 -2.722411 0.022717
H  -1.989949 -1.71819 -3.08468
H  -3.209708 -0.913636 3.111797
