program: Gaussian 09
title: 000091899
version: EM64L-G09RevD.01
frameworkgroup: C1[X(C13H14BrNO3)]
method: RPBEPBE
basis: SDD
operation: Freq
keyword: #p
keyword: freq=noraman
keyword: PBEPBE/SDD
title: #p freq=noraman PBEPBE/SDD
converged: YES YES NO NO
title: Mulliken charges:
elementType: Br O O O N C C C C C C C C C C C C C H H H H H H H H H H H H H H
charge: 0.068215 -0.290246 -0.257188 -0.266357 -0.039207 0.616476 -0.520672 -0.608531 0.498593 0.469239 -0.406031 -0.653729 0.360802 -0.398651 -0.516503 -0.537128 -0.260346 -0.497699 0.271522 0.257067 0.227284 0.204504 0.207105 0.220255 0.236764 0.239574 0.237242 0.236823 0.248683 0.208387 0.241105 0.202647
chargesum: 0.00000
title: Mulliken charges with hydrogens summed into heavy atoms:
elementType: Br O O O N C C C C C C C C C C C C C
charge: 0.068215 -0.290246 -0.257188 -0.266357 -0.039207 0.616476 -0.249150 -0.351463 0.498593 0.469239 -0.178747 -0.653729 0.360802 0.012959 0.180090 0.185619 -0.260346 0.154440
polarizability: 3.12379513e+02 -1.21572000e+01 1.94901845e+02 5.31524480e+00 5.34972584e+00 9.15505403e+01
1716.lowfreq: -6.5931 -4.5766 -3.0209 0.0002 0.0004 0.0006 20.7253 27.3127 39.7306
frequency: 20.6693 27.2731 39.6676 59.5549 68.1152 74.3683 91.0072 109.2225 131.8765 133.6045 148.6542 156.2947 171.6201 200.0476 208.6528 218.8773 236.3041 273.9848 288.9721 314.6333 325.4326 348.3275 363.0579 392.3491 434.2082 503.1996 538.2409 584.0386 600.7337 621.0838 639.2329 664.8835 742.5117 745.7705 785.1288 859.1943 862.0244 867.7893 886.5090 935.2315 947.4972 988.6985 1009.4358 1031.6100 1051.7275 1063.4126 1108.5191 1109.0859 1109.9948 1143.4042 1152.9052 1160.0567 1173.0133 1179.3639 1199.4825 1238.0013 1298.6895 1356.0940 1363.4198 1383.4928 1410.5064 1433.7931 1435.6640 1442.3890 1447.9374 1458.7626 1459.1697 1465.2097 1469.2807 1469.5144 1470.5266 1477.1755 1567.9445 1583.8836 1622.7934 2150.4068 2922.6961 2932.5711 2966.6991 2975.6313 2978.2318 3006.9353 3060.5421 3070.1525 3099.7988 3112.0430 3126.4697 3138.3403 3150.7863 3204.7193
redmass: 4.2895 6.8032 5.3664 3.0038 3.0022 2.8541 5.3392 4.1268 1.2986 5.0034 3.6810 5.4436 2.3537 4.5925 1.5894 2.1376 2.8906 2.1665 4.4534 4.6849 4.4539 4.3519 4.5690 5.6370 5.7828 6.8251 6.8024 5.3789 5.2609 4.7178 5.1636 4.3462 5.7534 2.7324 4.7977 2.2178 3.9186 2.1603 2.5719 5.3965 1.7216 2.2774 5.8129 4.7724 4.1559 6.8425 1.2604 1.2374 1.2727 1.5162 1.3869 1.4702 1.5253 2.1024 1.1587 1.7331 4.1834 1.7995 1.8369 4.1862 1.6855 1.7282 1.3885 1.3185 1.5830 1.0545 1.0595 1.0766 1.0583 1.0496 1.0943 1.0692 7.3710 5.3722 7.2563 12.6137 1.0507 1.0387 1.0320 1.0323 1.1058 1.1032 1.1038 1.1048 1.0886 1.0974 1.1012 1.1009 1.0920 1.0899
irintensity: 0.9000 4.3333 1.4430 5.6419 5.2596 2.9214 5.2404 4.1211 0.4330 3.4861 1.8917 1.9089 2.9949 1.9038 1.6504 4.2636 0.5507 0.3278 3.8769 2.8810 0.9400 3.3961 0.6012 6.1613 4.4080 2.3745 21.1780 5.5296 8.8713 4.7586 10.8126 6.7639 1.8854 3.4460 6.9510 7.2861 0.8833 0.7155 50.0812 19.7906 24.9968 28.5570 40.5663 125.9421 80.2402 200.2768 0.0708 0.8042 2.4784 19.1800 11.8774 14.3052 3.1545 3.3620 8.4848 97.6968 115.2237 48.0527 4.3881 18.8827 92.4317 28.4419 20.7743 7.9409 30.4309 12.9285 17.2061 7.6137 16.5801 12.4552 43.8451 7.5157 134.6659 18.2087 69.3437 39.3533 37.3962 138.1174 68.9971 29.5072 42.9070 59.6630 30.0516 32.8383 15.3813 24.4871 26.4111 19.0217 2.3041 7.0247
temp: 298.150 k
press: 1.00000 atm
elementType: 35 8 8 8 7 6 6 6 6 6 6 6 6 6 6 6 6 6 1 1 1 1 1 1 1 1 1 1 1 1 1 1
symmnumber: 1
zpe: 633128.5 jmol-1
zpe.correction: 0.241146 hartree
zpe.thermalcorrener: 0.261104 hartree
zpe.thermalcorrenthalpy: 0.262049 hartree
zpe.thermalcorrgfe: 0.189494 hartree
zpe.sumelectzpe: -796.241642 hartree
zpe.sumelectthermal: -796.221684 hartree
zpe.sumelectthermalent: -796.220740 hartree
zpe.sumelectthermalfe: -796.293294 hartree
dipole: -2.3430 -3.0660 0.1300
dipole: 3.8609
quadrupole: -102.1194 -106.7022 -117.6828
quadrupole: 11.9709 12.5749 -2.8220
quadrupole: 6.7154 2.1326 -8.8480 11.9709 12.5749 -2.8220
hfenergy: -796.4827884 hartree
pointgroup: C01 [X(C13H14Br1N1O3)]
dipole: -1.0940352 1.0079452 0.307345 debye
polarizability: 303.4455988|34.6252251|193.4309325|-16.0538087|27.8891796|101.9553668 unknown
InChI: InChI=1S/C13H14BrNO3/c1-16-8-10(7-15)4-9-5-11(17-2)13(14)12(6-9)18-3/h4-6H,8H2,1-3H3
charge 0 multiplicity 1
32 atoms
Br 4.71687 0.346733 -0.35296
O  2.856347 2.61406 0.869652
O  2.755954 -1.891585 -0.948271
O  -4.668545 -0.178819 -0.388677
N  -2.109246 -3.01061 -0.522825
C  -0.014838 0.277928 0.377644
C  0.649085 -0.848959 -0.183444
C  0.750003 1.432482 0.694515
C  2.141944 1.46967 0.465692
C  2.041858 -0.825405 -0.412713
C  -1.454891 0.333729 0.656438
C  2.79611 0.340858 -0.085061
C  -2.454095 -0.597955 0.477185
C  -3.891135 -0.286002 0.853686
C  3.148797 3.584229 -0.208147
C  2.011948 -3.114634 -1.290368
C  -2.246936 -1.906532 -0.07705
C  -6.111927 -0.166445 -0.138484
H  0.08246 -1.744662 -0.438065
H  0.2810 2.316106 1.140242
H  -1.788436 1.291548 1.082105
H  -4.31059 -1.098285 1.488666
H  -3.935648 0.665634 1.426433
H  2.208143 3.97945 -0.63838
H  3.762249 3.123151 -1.003951
H  3.713002 4.394935 0.276036
H  1.246298 -2.913712 -2.062704
H  1.533304 -3.554327 -0.395601
H  2.773869 -3.801117 -1.685304
H  -6.44145 -1.093212 0.377036
H  -6.589421 -0.108714 -1.128538
H  -6.415982 0.712263 0.469415
