program: Gaussian 09
title: 000091855
version: EM64L-G09RevD.01
frameworkgroup: C1[X(C17H20O)]
method: RPBEPBE
basis: SDD
operation: Freq
keyword: #pfreq=noraman
keyword: PBEPBE/SDD
title: #p freq=noraman PBEPBE/SDD
converged: NO YES NO NO
title: Mulliken charges:
elementType: O C C C C C C C C C C C C C C C C C H H H H H H H H H H H H H H H H H H H H
charge: -0.472969 0.019135 0.272113 -0.438967 0.363255 0.292361 -0.537079 -0.709533 0.461099 -0.355909 -0.431671 -0.401793 -0.867943 -0.439676 -0.230232 -0.241133 -0.816796 -0.243820 0.196369 0.217603 0.304042 0.207508 0.234112 0.231927 0.345704 0.264129 0.252029 0.223898 0.226516 0.227598 0.261304 0.228073 0.226697 0.225130 0.228377 0.219046 0.230595 0.228903
chargesum: 0.00000
title: Mulliken charges with hydrogens summed into heavy atoms:
elementType: O C C C C C C C C C C C C C C C C C
charge: -0.127265 0.019135 0.272113 -0.024995 0.363255 0.292361 -0.233038 -0.035987 0.461099 -0.091781 -0.179642 -0.177895 -0.152525 -0.211602 -0.003535 -0.016003 -0.138778 -0.014916
polarizability: 2.28345102e+02 -8.53870658e+00 1.61534793e+02 -1.46680277e+01 4.44693460e+00 1.55546803e+02
1716.lowfreq: -23.6840 -2.7182 0.0005 0.0005 0.0007 9.4256 10.9555 37.0162 43.7076
frequency: -23.5781 37.0022 43.6516 65.6893 94.2042 123.6819 147.3785 158.1464 194.1538 200.0618 232.6739 238.7294 253.9432 270.2574 308.1324 320.2568 328.2742 341.9956 361.4840 382.1361 400.4174 455.5162 460.1601 485.4952 516.3082 557.1131 603.1943 615.8483 638.2690 684.4633 704.8460 734.3422 740.2546 771.7445 782.8403 820.5904 829.1238 857.3099 906.6260 916.1933 934.9738 935.6596 951.3092 967.3942 981.5791 990.7104 991.8755 998.6282 1010.9459 1029.0195 1041.7587 1049.7585 1066.5977 1075.8055 1086.0263 1108.2168 1119.6059 1162.0568 1172.7982 1194.2621 1194.8504 1212.9726 1233.9615 1253.0084 1286.0384 1314.1559 1328.1109 1342.1233 1362.6075 1378.4796 1389.6201 1395.1042 1397.6643 1403.6711 1434.5543 1461.7162 1469.6707 1472.7061 1474.8279 1479.8470 1482.5648 1486.0485 1491.4644 1494.5671 1581.8186 1588.3416 1608.3530 1620.8537 2973.1590 2973.9011 2975.3077 2988.3563 3044.3268 3052.7690 3055.6464 3080.1604 3080.7561 3090.1635 3094.9062 3108.5668 3123.3692 3132.3776 3134.3331 3146.4340 3153.9163 3162.8841 3165.6905 3558.4345
redmass: 1.0219 3.8661 3.7247 4.5416 3.0080 2.7285 3.3416 1.4178 2.4216 1.9967 1.2949 3.6397 3.7985 1.2988 2.4809 3.3332 3.3159 2.9940 3.4392 3.2115 2.8265 2.9719 4.6321 3.1687 3.5255 3.7064 3.5583 6.3126 4.9516 6.1900 1.6803 3.8958 3.3641 2.3100 1.6367 1.3503 1.9238 1.2588 2.6078 2.7715 1.5240 1.4760 1.6618 1.6874 1.3881 3.3042 2.1058 1.3176 1.3574 2.2332 1.5704 1.5540 2.0597 1.9796 2.5259 1.9458 1.6833 1.3302 1.0531 1.8034 1.5770 2.3162 2.4418 1.4924 1.3462 1.4137 1.4414 1.5902 6.5619 6.4812 1.2403 1.2957 1.2283 2.7741 2.2241 1.1058 1.0569 1.0548 1.1058 1.4132 1.4284 1.1177 1.1787 2.0323 5.6219 5.9935 5.9680 6.6374 1.0379 1.0451 1.0591 1.0371 1.0944 1.0960 1.0925 1.0994 1.0994 1.0983 1.1001 1.0868 1.0845 1.0879 1.0967 1.0920 1.0953 1.0905 1.1011 1.0659
irintensity: 0.4171 0.0544 0.1799 0.1064 0.4269 1.3319 0.2374 0.9810 0.5208 0.7420 1.5668 4.4335 0.8986 108.3190 19.9024 14.4878 7.1679 3.1458 8.4183 2.1389 0.2403 4.3143 1.1438 5.2384 12.0847 2.9293 14.6698 0.3616 8.6137 0.5888 57.4975 4.8865 5.7424 47.3463 7.6605 31.2254 19.5035 0.5040 32.7992 13.0831 10.0595 5.0024 8.5959 1.3328 0.5548 3.3668 2.4089 0.3012 2.9743 8.2548 3.5183 19.2832 5.2869 7.7193 1.4128 24.3572 24.2561 19.2987 0.1204 4.0555 13.6635 4.1104 15.7284 10.2105 2.8709 4.1664 6.6097 29.8295 0.1810 2.7606 14.8466 9.1818 3.3992 13.8877 12.2364 3.9644 9.9082 10.1877 7.4469 10.7784 9.9835 27.9385 23.8405 21.4549 1.2382 0.9985 4.3762 7.1982 56.1663 22.0992 48.7869 33.9863 19.5306 23.2088 18.2845 45.2311 17.1520 13.4003 26.2364 13.7504 0.9642 5.4931 36.8982 20.6218 30.4732 3.2866 19.9081 7.1973
temp: 298.150 k
press: 1.00000 atm
elementType: 8 6 6 6 6 6 6 6 6 6 6 6 6 6 6 6 6 6 1 1 1 1 1 1 1 1 1 1 1 1 1 1 1 1 1 1 1 1
symmnumber: 1
zpe: 838502.4 jmol-1
zpe.correction: 0.319369 hartree
zpe.thermalcorrener: 0.336428 hartree
zpe.thermalcorrenthalpy: 0.337372 hartree
zpe.thermalcorrgfe: 0.275190 hartree
zpe.sumelectzpe: -733.716014 hartree
zpe.sumelectthermal: -733.698955 hartree
zpe.sumelectthermalent: -733.698011 hartree
zpe.sumelectthermalfe: -733.760193 hartree
dipole: -1.5946 0.2037 0.4697
dipole: 1.6747
quadrupole: -98.8110 -103.9415 -105.9413
quadrupole: -3.8372 -0.3004 1.4348
quadrupole: 4.0869 -1.0436 -3.0434 -3.8372 -0.3004 1.4348
hfenergy: -734.0353827 hartree
pointgroup: C01 [X(C17H20O1)]
dipole: -0.6223405 -0.0832842 -0.1997215 debye
polarizability: 227.3883616|9.2627089|161.2191468|16.1770587|5.5283793|156.8191906 unknown
InChI: InChI=1S/C17H20O/c1-4-17(18,15-8-6-5-7-9-15)16-12-13(2)10-11-14(16)3/h5-12,18H,4H2,1-3H3
charge 0 multiplicity 1
38 atoms
O  -0.115008 -1.282219 1.843507
C  -0.313239 -1.017495 0.380728
C  0.922755 -0.200303 -0.067557
C  -0.386716 -2.402699 -0.327888
C  -1.620111 -0.195761 0.267921
C  1.068103 0.295473 -1.402833
C  1.945418 0.052247 0.878387
C  0.909483 -3.226271 -0.196251
C  3.116273 0.783537 0.559719
C  -1.648489 1.09895 0.853089
C  -2.81023 -0.699412 -0.315239
C  2.240101 1.030795 -1.712452
C  0.054712 0.073218 -2.516467
C  3.25274 1.272262 -0.759917
C  -2.829004 1.869596 0.850535
C  -3.996851 0.071296 -0.317657
C  4.176208 1.046382 1.616543
C  -4.01192 1.357719 0.264401
H  -1.225794 -2.972106 0.122056
H  -0.634806 -2.268853 -1.396712
H  1.807746 -0.336215 1.891077
H  0.767915 -4.240445 -0.612742
H  1.200141 -3.32198 0.864491
H  1.747229 -2.748397 -0.733645
H  -0.982511 -1.600402 2.201951
H  -0.732788 1.492085 1.307629
H  -2.822027 -1.689604 -0.781704
H  2.358277 1.420405 -2.731423
H  0.223035 0.793921 -3.335556
H  0.145938 -0.940064 -2.95424
H  -0.985671 0.191737 -2.171104
H  4.145186 1.843581 -1.043742
H  -2.829823 2.86732 1.303916
H  -4.906023 -0.333608 -0.776773
H  4.393257 0.136377 2.204878
H  5.121314 1.394447 1.164077
H  3.844102 1.823407 2.332324
H  -4.930521 1.95518 0.260273
