program: Gaussian 09
title: 000009643
version: EM64L-G09RevD.01
frameworkgroup: C1[X(C4Cl2F6)]
method: RPBEPBE
basis: SDD
operation: Freq
keyword: #pfreq=noraman
keyword: PBEPBE/SDD
title: #p freq=noraman PBEPBE/SDD
converged: NO YES NO NO
title: Mulliken charges:
elementType: Cl Cl F F F F F F C C C C
charge: 0.129692 0.129458 -0.100844 -0.100664 -0.134446 -0.129709 -0.129509 -0.134649 -0.103625 -0.103391 0.338911 0.338775
chargesum: 0.00000
title: Mulliken charges with hydrogens summed into heavy atoms:
polarizability: 7.04881740e+01 1.42029263e-03 5.65538697e+01 1.13559924e+01 2.07431323e-03 5.67798898e+01
1716.lowfreq: -8.0054 -6.2380 -0.0012 0.0014 0.0022 6.0459 11.6184 143.1975 168.2444
frequency: 0.5123 143.1968 168.2428 175.8121 197.1286 203.7662 242.8715 250.1556 256.8051 283.4652 300.1330 349.8610 364.1372 434.5713 435.5617 488.1632 538.6303 585.1236 736.1335 785.0223 795.3137 913.6111 959.1790 988.8923 1078.8452 1104.1615 1105.6655 1130.2418 1159.1403 1247.8450
redmass: 21.6237 27.6496 22.2088 22.0205 19.6745 20.1989 19.8027 20.7299 19.0745 18.6463 19.3538 24.3647 21.5120 17.7086 17.8363 17.4849 17.5103 17.7557 13.3670 13.0523 14.2141 12.0695 13.2036 12.9394 13.2231 13.0924 12.6236 12.4496 12.5551 12.5643
irintensity: 0.0257 0.0328 0.0416 3.9234 0.5540 0.0975 2.3448 0.9561 0.0227 1.0062 0.6894 0.1077 0.6758 7.9121 4.9551 14.0019 18.1000 7.1425 50.8255 94.9688 105.9913 16.9467 134.2859 3.8144 137.8510 164.1690 6.2255 3.3643 49.3051 69.9389
temp: 298.150 k
press: 1.00000 atm
elementType: 17 17 9 9 9 9 9 9 6 6 6 6
symmnumber: 1
zpe: 104207.8 jmol-1
zpe.correction: 0.039691 hartree
zpe.thermalcorrener: 0.051160 hartree
zpe.thermalcorrenthalpy: 0.052104 hartree
zpe.thermalcorrgfe: -0.002274 hartree
zpe.sumelectzpe: -1670.617824 hartree
zpe.sumelectthermal: -1670.606355 hartree
zpe.sumelectthermalent: -1670.605411 hartree
zpe.sumelectthermalfe: -1670.659789 hartree
dipole: 0.0003 -0.7933 0.0012
dipole: 0.7933
quadrupole: -78.6640 -81.0351 -83.4820
quadrupole: 0.0039 1.1729 0.0073
quadrupole: 2.3964 0.0252 -2.4216 0.0039 1.1729 0.0073
hfenergy: -1670.6575149 hartree
pointgroup: C01 [X(C4Cl2F6)]
dipole: -0.0081367 -0.3119885 0.0006058 debye
dipolederiv: -0.2654741 0.1330139 -0.2017479 0.1541073 -0.1870656 0.1627746 -0.1797414 0.1386942 -0.2715928 -0.2805387 -0.1294331 -0.2091772 -0.1503472 -0.1740382 -0.1524107 -0.1857387 -0.129525 -0.2697015 -0.2698143 0.036238 0.0778206 0.0553189 -0.2705245 -0.1490999 0.047224 -0.0831542 -0.6889866 -0.2745863 -0.035436 0.0857828 -0.0547616 -0.2641157 0.1419599 0.0519656 0.077769 -0.690649 -0.336033 -0.1265023 0.1410136 -0.1005819 -0.421922 0.2049733 0.1548453 0.226923 -0.5725267 -0.4042164 -0.1671084 -0.1850985 -0.1281229 -0.3751995 -0.1438879 -0.1812104 -0.1693255 -0.4826059 -0.3889675 0.1669577 -0.1787508 0.1279102 -0.3887124 0.1529021 -0.1731344 0.1781496 -0.484606 -0.3240277 0.1219419 0.1287341 0.0959847 -0.4367995 -0.2130052 0.1414787 -0.2356739 -0.5695151 0.5858669 -0.1565872 0.1818495 -0.2591177 0.387048 -0.0383307 0.1339552 -0.153923 0.9840149 0.6073463 0.1460752 0.1823729 0.2481949 0.3667517 0.0326695 0.1401307 0.1507286 0.9830642 0.6872734 0.3250805 -0.016691 0.1427873 0.8696873 -0.1429202 0.0250294 0.0292303 1.0321169 0.6631716 -0.3142402 -0.0061082 -0.1313721 0.8948904 0.1443751 0.025196 -0.0298932 1.0309876 unknown
polarizability: 62.8336852|-0.1190514|56.5558795|13.2361525|-0.3212574|64.4323688 unknown
InChI: InChI=1S/C4Cl2F6/c5-1(7)2(6,8)4(11,12)3(1,9)10
charge 0 multiplicity 1
12 atoms
Cl 1.808437 -1.646801 1.049268
Cl -1.8938 -1.555581 -1.038408
F  1.019901 -1.281844 -1.464591
F  -1.086257 -1.215778 1.473101
F  1.222412 1.393183 -1.319588
F  1.550709 1.332625 0.930357
F  -1.478819 1.406678 -0.939197
F  -1.145308 1.465181 1.309917
C  0.75774 -0.790178 -0.170991
C  -0.798677 -0.747601 0.1765
C  0.805592 0.798783 -0.1248
C  -0.761831 0.841333 0.118633
