program: Gaussian 09
title: 000091795
version: EM64L-G09RevD.01
frameworkgroup: C1[X(C10H20N4O3)]
method: RPBEPBE
basis: SDD
operation: Freq
keyword: #p
keyword: freq=noraman
keyword: PBEPBE/SDD
title: #p freq=noraman PBEPBE/SDD
converged: YES YES NO NO
title: Mulliken charges:
elementType: O O O N N N N C C C C C C C C C C H H H H H H H H H H H H H H H H H H H H
charge: -0.297309 -0.231314 -0.279190 -0.395318 -0.109089 -0.659774 -0.633950 -0.388939 -0.182571 -0.391285 -0.457098 0.209656 0.246858 -0.216526 -0.778543 0.211399 -0.676745 0.213222 0.287677 0.293748 0.192939 0.209801 0.192295 0.201163 0.332983 0.229402 0.233794 0.250192 0.251664 0.209804 0.216579 0.230388 0.228331 0.308994 0.335489 0.320665 0.290607
chargesum: 0.00000
title: Mulliken charges with hydrogens summed into heavy atoms:
elementType: O O O N N N N C C C C C C C C C C
charge: -0.297309 -0.231314 -0.279190 -0.062334 -0.109089 -0.015291 -0.022678 0.111959 0.111177 0.011456 -0.063641 0.209656 0.246858 0.246671 -0.066884 0.211399 -0.001446
polarizability: 1.74975079e+02 1.25971562e+01 1.53304096e+02 5.23287623e+00 -4.15544389e+00 1.22100338e+02
1716.lowfreq: -0.0007 -0.0006 0.0003 5.0671 7.2960 11.5795 20.7219 23.1873 34.4185
frequency: 20.6448 22.9572 34.3888 38.6022 52.8521 61.6935 71.2538 83.2164 86.4825 92.3322 143.2268 162.9259 175.8521 187.9894 221.1003 243.1953 255.7352 273.3731 307.0482 340.7919 350.2658 374.7652 393.0174 409.3294 433.7483 467.1055 498.0626 534.1268 554.9182 557.9107 575.7902 591.0586 608.5458 655.5004 681.1222 752.3006 771.5171 798.4351 802.8345 837.7955 858.8296 895.8689 943.9461 957.7741 978.6280 990.9772 1025.3272 1031.9638 1034.9979 1041.3042 1068.0722 1087.6983 1111.8766 1135.7386 1138.0502 1155.5478 1182.4162 1201.0518 1213.8720 1246.5777 1249.1106 1265.2019 1291.1270 1312.7619 1330.6038 1349.3482 1358.5625 1373.6882 1384.5637 1401.0867 1410.3653 1450.3965 1453.1820 1458.2838 1463.1860 1464.2143 1470.9023 1474.0021 1479.2122 1487.1680 1603.4951 1612.4114 1618.0399 1644.1098 1671.8924 2868.9825 2912.3795 2974.7494 2995.3416 2995.6203 2999.1520 3013.7257 3016.6732 3038.1880 3071.9815 3081.9151 3092.2914 3094.5490 3102.4563 3107.0961 3518.5254 3553.2137 3564.0754 3665.4092 3699.2412
redmass: 3.8753 5.0297 3.7953 4.0463 3.1308 3.3943 2.0623 1.7459 5.1665 2.6242 2.4234 3.7390 3.0988 3.9576 3.4939 1.5463 2.6520 1.9873 3.5166 3.7627 1.5264 2.6551 1.3584 1.8108 1.1862 2.2748 3.1638 3.0156 3.1941 2.5348 1.3830 2.2650 2.2540 3.4311 4.6696 4.0364 1.6109 1.1107 3.9644 2.5606 2.8050 3.9460 3.3921 2.6159 2.2676 1.7318 2.3919 1.4817 2.2681 1.6521 2.1964 2.3805 2.2380 2.0027 2.2410 2.1428 2.0097 1.4050 1.5283 1.5720 1.1348 1.3253 1.2390 1.4453 1.3127 1.3945 1.3961 1.4780 1.2344 1.2666 4.3026 1.0523 1.0901 1.0881 1.1969 1.0426 1.0908 1.0929 1.6828 1.0842 1.2302 6.6810 1.2899 10.5410 3.4914 1.0547 1.1017 1.0617 1.0358 1.0358 1.0649 1.0584 1.0818 1.0974 1.1063 1.1009 1.0985 1.0993 1.0994 1.1031 1.0451 1.0453 1.0781 1.1015 1.1028
irintensity: 1.8890 0.6271 1.7104 4.3638 5.3446 5.2517 5.0330 0.5396 1.2042 1.3950 2.7163 5.4948 1.7279 4.8289 9.8796 0.2752 3.8417 7.4335 4.2345 38.8429 63.6821 11.2817 123.5009 105.6445 81.2433 13.3582 27.8592 6.8156 54.4303 95.0626 138.4247 72.5941 10.3543 5.3279 89.6377 4.7848 13.5883 3.8906 6.5428 4.2399 6.9999 30.4826 18.0154 15.1139 10.1318 13.8887 69.5346 16.6290 33.0711 15.6753 56.5819 13.6453 4.9367 14.4932 18.9802 133.7088 3.9635 7.6368 122.8584 41.1915 0.4501 2.7764 13.9185 14.4009 8.9236 47.6876 0.5328 12.2145 61.7954 22.4676 114.7592 21.6737 2.9325 23.8391 141.5954 10.3795 15.9535 16.6501 173.2960 36.6323 134.9495 166.3290 92.4434 166.9697 577.8125 76.7444 55.2386 56.6587 7.6495 24.6021 13.7815 18.3620 12.6882 37.1169 5.0636 15.1796 32.4219 15.5819 15.3790 45.5939 18.3234 18.3935 48.7926 19.2078 19.4277
temp: 298.150 k
press: 1.00000 atm
elementType: 8 8 8 7 7 7 7 6 6 6 6 6 6 6 6 6 6 1 1 1 1 1 1 1 1 1 1 1 1 1 1 1 1 1 1 1 1
symmnumber: 1
zpe: 809075.2 jmol-1
zpe.correction: 0.308160 hartree
zpe.thermalcorrener: 0.328996 hartree
zpe.thermalcorrenthalpy: 0.329940 hartree
zpe.thermalcorrgfe: 0.255204 hartree
zpe.sumelectzpe: -836.404893 hartree
zpe.sumelectthermal: -836.384057 hartree
zpe.sumelectthermalent: -836.383113 hartree
zpe.sumelectthermalfe: -836.457850 hartree
dipole: 1.4180 -3.5035 -4.6396
dipole: 5.9842
quadrupole: -64.4993 -101.6332 -109.9997
quadrupole: -4.9425 8.3947 -3.1670
quadrupole: 27.5447 -9.5892 -17.9556 -4.9425 8.3947 -3.1670
hfenergy: -836.7130536 hartree
pointgroup: C01 [X(C10H20N4O3)]
dipole: 0.5837414 1.3512843 1.8374743 debye
polarizability: 174.3644903|-13.0846083|154.0220712|-5.1530191|-3.8742432|121.9929518 unknown
InChI: InChI=1S/C10H20N4O3/c1-3-17-9(16)8(14-7(2)15)5-4-6-13-10(11)12/h8,14H,3-6,11-12H2,1-2H3
charge 0 multiplicity 1
37 atoms
O  -2.829833 0.819313 0.291531
O  -2.312759 1.587509 -1.846403
O  -0.491601 -3.13267 -1.076754
N  -1.33183 -1.337078 0.13337
N  3.03282 0.251198 0.198081
N  5.067091 1.569355 0.376159
N  5.113921 -0.771668 0.580187
C  0.318194 0.193043 -1.019574
C  -1.13088 -0.386745 -0.969573
C  0.703263 1.05169 0.200641
C  2.190881 1.463409 0.153994
C  -2.140963 0.757325 -0.927061
C  -0.987324 -2.67011 -0.002102
C  -3.810065 1.940934 0.437245
C  -1.238762 -3.543763 1.224506
C  4.328494 0.373865 0.364402
C  -4.444784 1.800963 1.816605
H  0.410717 0.789761 -1.947926
H  1.017808 -0.657526 -1.092698
H  -1.287664 -0.939955 -1.915893
H  0.077143 1.966773 0.245766
H  0.533675 0.476762 1.131192
H  2.36218 2.045079 -0.784117
H  2.402997 2.154422 1.005813
H  -1.778507 -0.990817 0.983361
H  -3.262248 2.892545 0.31425
H  -4.547132 1.860258 -0.381548
H  -1.840792 -4.418594 0.925648
H  -0.272156 -3.923151 1.59984
H  -1.753792 -3.013671 2.044546
H  -5.17786 2.613134 1.973314
H  -4.97219 0.836515 1.913442
H  -3.682524 1.865858 2.612043
H  5.971495 1.615225 0.839792
H  4.603318 2.441666 0.140779
H  4.583684 -1.64189 0.611811
H  6.051587 -0.811662 0.181631
