program: Gaussian 09
title: 000091815
version: EM64L-G09RevD.01
frameworkgroup: C1[X(C14H13NO3)]
method: RPBEPBE
basis: SDD
operation: Freq
keyword: #p
keyword: freq=noraman
keyword: PBEPBE/SDD
title: #p freq=noraman PBEPBE/SDD
converged: YES YES NO NO
title: Mulliken charges:
elementType: O O O N C C C C C C C C C C C C C C H H H H H H H H H H H H H
charge: -0.306247 -0.418150 -0.353428 -0.686952 0.061104 0.439999 0.373365 0.204402 -0.309524 0.568708 -0.558631 -0.355737 -0.379152 -0.407804 -0.309322 -0.440917 0.226872 -0.806693 0.259239 0.247534 0.232755 0.231486 0.250087 0.309179 0.221441 0.224151 0.236432 0.226277 0.316101 0.313722 0.389698
chargesum: 0.00000
title: Mulliken charges with hydrogens summed into heavy atoms:
elementType: O O O N C C C C C C C C C C C C C C
charge: -0.306247 -0.028451 -0.353428 -0.057128 0.061104 0.439999 0.373365 0.204402 -0.050285 0.568708 -0.311097 -0.122982 -0.147665 -0.157717 -0.000143 -0.219476 0.226872 -0.119833
polarizability: 3.35315864e+02 -1.55256352e+01 1.75677872e+02 -8.90612531e-01 -9.75302270e-01 7.15960144e+01
1716.lowfreq: -10.0550 -4.9114 -0.0011 -0.0010 -0.0009 3.8714 8.2252 18.3095 32.3609
frequency: -9.0911 17.3022 32.2976 69.4242 87.9807 115.1757 158.8034 180.9351 222.5005 232.6004 279.3723 314.4327 339.9659 343.8358 381.4625 410.9554 417.2625 417.5958 437.6339 456.3716 468.6534 505.3399 517.8243 572.7488 611.7468 623.8383 636.6903 666.4294 709.0386 720.3541 739.3162 739.6437 787.2784 807.5104 820.8920 826.4692 842.9509 853.2891 864.2647 949.5232 954.1343 962.7937 979.3029 986.1012 1007.7530 1028.4859 1046.7455 1051.0371 1118.4845 1144.6715 1158.0635 1195.8987 1201.4763 1220.7459 1225.5783 1280.5299 1301.1630 1346.1678 1368.5245 1379.8940 1397.8323 1407.2307 1412.2715 1451.0966 1473.0763 1473.5109 1491.9007 1504.0730 1566.8159 1579.1925 1589.3875 1618.9603 1645.1189 1663.6079 2974.5416 2984.7521 3055.4050 3084.6085 3127.8312 3130.6378 3135.2695 3157.2270 3165.2038 3175.0700 3212.4004 3559.8778 3700.2804
redmass: 1.0327 3.9435 5.0646 5.1463 4.7682 9.1701 5.0559 5.5460 5.2568 5.2648 5.1517 3.6934 4.3268 3.5195 6.5341 3.0556 1.1829 4.6764 1.2435 2.4136 4.9861 2.6205 6.5378 5.3222 6.7133 7.3578 6.7849 3.1782 3.2256 6.3299 5.6172 3.3078 7.2177 1.5652 5.4421 1.4748 1.2546 1.6683 1.1701 2.7597 1.3232 1.3334 1.3425 1.3969 3.1473 2.8829 1.5542 1.8834 1.2581 1.4740 2.0765 1.6240 1.7772 2.3527 2.1962 2.4790 1.2982 2.8834 4.3090 2.8913 1.2258 3.3458 3.5960 5.4035 1.0689 1.0915 2.6067 4.1255 6.4616 3.4627 6.3665 6.4611 1.1937 5.1438 1.0387 1.0692 1.0950 1.0997 1.0900 1.0905 1.0893 1.0920 1.0956 1.0952 1.0941 1.0451 1.1040
irintensity: 0.5559 1.0546 0.9311 1.4624 0.0510 1.1678 0.2800 1.4553 2.5022 1.4225 2.7938 2.6820 7.2376 10.5052 12.6794 0.4508 91.6516 8.8609 171.8438 33.2700 3.1523 21.8710 20.9522 0.7914 10.4952 0.7089 13.8497 15.4052 0.5569 1.9555 2.8271 0.5747 5.3001 21.9188 13.0981 54.0444 0.0857 184.6211 45.3828 17.9549 6.1214 0.2573 2.9569 0.2645 4.2577 102.5146 41.4745 97.7980 16.7220 128.0855 366.5863 175.9123 122.8791 33.7774 94.5762 578.1550 42.0424 124.7622 61.5086 340.0019 13.8665 21.2349 92.2584 126.6565 13.8890 14.6675 141.9461 70.7868 145.2917 8.0434 11.2499 6.2611 116.4846 699.0136 52.6458 331.3775 23.8685 17.8665 19.3156 23.3495 12.8877 9.2936 5.9539 6.3874 4.9138 141.5935 25.1479
temp: 298.150 k
press: 1.00000 atm
elementType: 8 8 8 7 6 6 6 6 6 6 6 6 6 6 6 6 6 6 1 1 1 1 1 1 1 1 1 1 1 1 1
symmnumber: 1
zpe: 627288.5 jmol-1
zpe.correction: 0.238922 hartree
zpe.thermalcorrener: 0.254295 hartree
zpe.thermalcorrenthalpy: 0.255240 hartree
zpe.thermalcorrgfe: 0.194962 hartree
zpe.sumelectzpe: -820.464695 hartree
zpe.sumelectthermal: -820.449321 hartree
zpe.sumelectthermalent: -820.448377 hartree
zpe.sumelectthermalfe: -820.508655 hartree
dipole: 1.7368 -3.8089 -0.0479
dipole: 4.1864
quadrupole: -58.7945 -99.9135 -111.4018
quadrupole: -12.1631 -0.6122 -0.4940
quadrupole: 31.2421 -9.8769 -21.3652 -12.1631 -0.6122 -0.4940
hfenergy: -820.7036168 hartree
pointgroup: C01 [X(C14H13N1O3)]
dipole: -0.6940792 0.8954921 -1.1954949 debye
polarizability: 335.4942954|-11.1302766|110.666922|9.6098801|-50.3100988|136.4285333 unknown
InChI: InChI=1S/C14H13NO3/c1-9-2-5-11(6-3-9)18-14(17)12-7-4-10(15)8-13(12)16/h2-8,16H,15H2,1H3
charge 0 multiplicity 1
31 atoms
O  0.547328 0.238874 -0.232397
O  -2.584191 -1.418222 2.124249
O  -0.076049 -1.096649 1.604678
N  -5.82878 0.715036 -0.740436
C  -1.770419 -0.062326 0.230915
C  4.807089 0.07917 -0.148878
C  1.966583 0.119345 -0.111288
C  -2.838851 -0.619702 1.028238
C  -2.118847 0.752814 -0.886266
C  -4.505175 0.454927 -0.413807
C  -4.183182 -0.358505 0.702784
C  4.077115 0.881111 -1.065536
C  4.071683 -0.701795 0.776973
C  2.668838 0.905835 -1.051388
C  2.658577 -0.695206 0.81456
C  -3.44927 1.013292 -1.212714
C  -0.395403 -0.360033 0.605331
C  6.325953 0.080336 -0.147296
H  -1.310113 1.174074 -1.48973
H  -4.963174 -0.799034 1.331639
H  4.616346 1.491979 -1.79926
H  4.609986 -1.335255 1.492378
H  2.10268 1.520175 -1.758065
H  2.109865 -1.298896 1.537002
H  -3.696174 1.641667 -2.075801
H  6.731987 0.236958 -1.162453
H  6.723482 0.891667 0.493359
H  6.731827 -0.870872 0.239226
H  -6.588956 0.32787 -0.188061
H  -6.062974 1.296598 -1.540103
H  -1.56908 -1.505833 2.216146
