program: Gaussian 09
title: 000091758
version: EM64L-G09RevD.01
frameworkgroup: C1[X(C9H18NO3PS2)]
method: RPBEPBE
basis: SDD
operation: Freq
keyword: #p
keyword: freq=noraman
keyword: PBEPBE/SDD
title: #p freq=noraman PBEPBE/SDD
converged: YES YES NO NO
title: Mulliken charges:
elementType: S S P O O O N C C C C C C C C C H H H H H H H H H H H H H H H H H H
charge: 0.051326 0.204054 1.049277 -0.463026 -0.617662 -0.166783 -0.510140 -0.274689 -0.367240 -0.682329 -0.343184 -0.001797 -0.630294 -0.669454 -0.215840 -0.656509 0.277070 0.254402 0.307165 0.273684 0.281464 0.216500 0.208952 0.211160 0.245623 0.223887 0.210044 0.231286 0.217586 0.219828 0.227615 0.206688 0.234382 0.246953
chargesum: 0.00000
title: Mulliken charges with hydrogens summed into heavy atoms:
elementType: S S P O O O N C C C C C C C C C
charge: 0.051326 0.204054 1.049277 -0.463026 -0.617662 -0.166783 -0.510140 0.256783 -0.060075 -0.127181 0.082268 -0.001797 0.050376 -0.010537 0.231603 0.031513
polarizability: 2.19137398e+02 5.98837614e+00 1.67195876e+02 -3.44391528e+00 -2.33617242e+00 1.53582847e+02
1716.lowfreq: -14.1467 -0.0027 -0.0011 0.0007 5.3021 10.2834 13.1809 21.6932 30.0058
frequency: -10.4332 21.5048 29.6971 40.4236 47.1822 63.6145 79.0734 96.1740 103.1551 120.4413 153.7579 168.7048 187.2200 216.4694 219.0006 231.5670 234.3753 251.4741 262.9953 275.6574 294.1643 314.2205 327.2082 386.5148 396.6081 423.7361 443.4577 466.0759 505.0464 548.9296 619.5064 632.9028 661.8936 671.7330 731.4993 783.2584 812.6109 838.3713 868.8495 880.0673 960.8748 979.5119 994.8674 1007.6868 1011.9003 1013.5220 1036.0232 1059.2807 1081.1905 1104.5310 1116.3713 1128.7373 1134.3184 1159.2486 1187.5195 1217.4443 1239.1081 1251.5745 1283.6160 1286.0491 1293.3874 1341.8342 1351.9248 1353.6419 1389.9074 1391.5854 1394.1199 1451.5441 1455.9056 1455.9291 1465.9975 1470.5647 1474.5348 1476.8118 1482.1319 1485.5986 1487.0331 1658.1015 2968.7495 2977.2202 2981.7374 2985.9287 2997.1475 2998.8693 3014.3907 3029.7229 3050.5505 3051.6231 3071.7872 3077.2037 3086.7499 3091.3361 3093.4920 3098.1191 3115.5202 3135.8691
redmass: 3.5763 3.5929 4.7899 4.2451 4.6471 2.2246 3.6508 2.0414 5.8307 5.3286 6.0748 3.0091 2.3386 1.1959 1.8958 1.7901 2.0030 4.8339 2.7024 4.5981 4.2459 3.1183 4.1424 7.7891 6.0926 8.7493 3.0405 5.1505 10.0189 3.7073 9.9842 7.2485 5.1523 3.7476 6.7656 1.1996 1.0887 2.0364 4.0587 1.7523 1.2854 2.9050 1.3674 2.5035 3.4845 1.9949 3.0238 3.0710 1.4648 2.2479 2.5137 1.4011 2.6373 2.0974 1.8938 1.3847 1.2307 1.1607 1.1949 1.2080 1.2136 1.5434 1.2609 1.3388 1.2041 1.2077 1.2354 1.0934 1.0450 1.0571 1.0529 1.0483 1.0421 1.0589 1.0771 1.0526 1.0768 12.6003 1.0587 1.0388 1.0368 1.0541 1.0382 1.0654 1.0938 1.0929 1.0590 1.1082 1.0970 1.0995 1.0999 1.0987 1.0977 1.1004 1.1022 1.1090
irintensity: 0.2675 0.5245 1.6879 2.6686 0.4545 4.4054 1.4269 0.3368 1.8602 5.6019 4.9549 3.3737 1.0090 2.4065 5.2124 3.5745 0.3816 2.6327 6.3600 0.1135 3.2935 2.0523 7.9032 20.1893 27.6263 50.6881 5.9103 8.5027 209.7320 3.0963 15.0150 12.3838 61.9598 25.3624 0.7556 18.4104 2.6197 7.0153 196.5916 19.4348 6.3117 71.1996 37.5336 27.6170 116.5602 46.5365 3.8858 404.5707 4.8525 18.0922 1.9461 2.2593 44.6808 3.7690 19.5378 56.5083 1.6531 0.3754 18.4692 19.1694 14.7340 5.9250 6.8693 9.6357 3.0224 27.1490 28.4039 9.9550 13.3993 3.3767 19.7310 3.8031 17.9625 9.0072 8.8701 13.4666 7.8832 252.8232 21.0980 50.0352 22.6582 30.5096 25.8360 25.1462 5.5298 6.6956 24.7291 18.8125 22.2686 42.3559 40.5173 3.6360 24.5166 19.3105 27.4308 10.2865
temp: 298.150 k
press: 1.00000 atm
elementType: 16 16 15 8 8 8 7 6 6 6 6 6 6 6 6 6 1 1 1 1 1 1 1 1 1 1 1 1 1 1 1 1 1 1
symmnumber: 1
zpe: 702023.0 jmol-1
zpe.correction: 0.267386 hartree
zpe.thermalcorrener: 0.287453 hartree
zpe.thermalcorrenthalpy: 0.288398 hartree
zpe.thermalcorrgfe: 0.216529 hartree
zpe.sumelectzpe: -1770.247701 hartree
zpe.sumelectthermal: -1770.227634 hartree
zpe.sumelectthermalent: -1770.226690 hartree
zpe.sumelectthermalfe: -1770.298558 hartree
dipole: -0.0833 -0.3168 3.7993
dipole: 3.8133
quadrupole: -105.2771 -111.0406 -130.2304
quadrupole: -5.2016 -12.1207 -4.0578
quadrupole: 10.2390 4.4754 -14.7144 -5.2016 -12.1207 -4.0578
hfenergy: -1770.5150875 hartree
pointgroup: C01 [X(C9H18N1O3P1S2)]
dipole: -0.0689319 0.0529031 -1.4977667 debye
polarizability: 218.9833855|-7.0870342|167.234304|2.0347685|-2.8924685|153.6984312 unknown
InChI: InChI=1S/C9H18NO3PS2/c1-4-8(3)16-14(12,13-5-2)10-6-7-15-9(10)11/h8H,4-7H2,1-3H3
charge 0 multiplicity 1
34 atoms
S  1.733314 -0.037777 1.143114
S  -3.286478 1.953457 0.766006
P  0.129936 -0.672519 -0.30991
O  -0.41243 -2.136691 0.423978
O  0.555806 -0.713733 -1.851322
O  -1.557229 0.285343 2.17705
N  -1.272882 0.442523 -0.169565
C  -1.644989 1.305046 -1.322626
C  3.208944 -0.108266 -0.126359
C  -3.118248 1.694993 -1.105935
C  4.177027 1.041774 0.224555
C  -1.876728 0.739714 1.062833
C  3.854138 -1.500765 -0.07327
C  3.617949 2.453319 -0.044518
C  -1.62536 -2.827225 -0.12122
C  -1.852841 -4.028853 0.789907
H  -1.49366 0.749718 -2.262049
H  -1.002561 2.206491 -1.338335
H  2.73866 0.063666 -1.112488
H  -3.371204 2.635869 -1.615779
H  -3.811109 0.894477 -1.407369
H  4.498865 0.949849 1.281157
H  5.088408 0.880059 -0.387772
H  4.683329 -1.553238 -0.805864
H  3.125677 -2.290475 -0.323397
H  4.264344 -1.714076 0.929982
H  3.332578 2.56918 -1.106954
H  2.722691 2.648222 0.571738
H  4.371843 3.225908 0.191338
H  -2.482717 -2.127009 -0.094108
H  -1.425682 -3.127578 -1.167174
H  -2.741416 -4.594072 0.452018
H  -0.979946 -4.702585 0.770762
H  -2.017928 -3.697548 1.828474
