program: Gaussian 09
title: 000091913
version: EM64L-G09RevD.01
frameworkgroup: C1[X(C33H21NO3)]
method: RPBEPBE
basis: SDD
operation: Freq
keyword: #p
keyword: freq=noraman
keyword: PBEPBE/SDD
title: #p freq=noraman PBEPBE/SDD
converged: YES YES NO NO
title: Mulliken charges:
elementType: O O O N C C C C C C C C C C C C C C C C C C C C C C C C C C C C C C C C C H H H H H H H H H H H H H H H H H H H H H
charge: -0.300281 -0.192184 -0.230921 -0.494892 0.026127 0.324646 0.302877 0.289022 0.264402 -0.088309 -0.265508 -0.428440 -0.381907 -0.225845 -0.379112 -0.374433 0.434537 -0.226215 -0.226737 0.307766 -0.401960 -0.441383 -0.379419 -0.349802 0.299539 -0.006457 0.352202 -0.379574 -0.376918 0.339946 -0.397065 -0.407716 -0.393424 -0.392999 -0.235705 -0.235619 -0.239054 0.295598 0.276603 0.380193 0.239637 0.293378 0.291814 0.240769 0.241246 0.270806 0.250493 0.270571 0.275512 0.271333 0.263827 0.242378 0.239841 0.240216 0.238202 0.228379 0.227897 0.232123
chargesum: 0.00000
title: Mulliken charges with hydrogens summed into heavy atoms:
elementType: O O O N C C C C C C C C C C C C C C C C C C C C C C C C C C C C C C C C C
charge: -0.300281 -0.192184 -0.230921 -0.114698 0.026127 0.324646 0.302877 0.289022 0.264402 -0.088309 -0.265508 -0.132842 -0.105304 0.013792 -0.085734 -0.082620 0.434537 0.014554 0.014510 0.307766 -0.131154 -0.190890 -0.108848 -0.074291 0.299539 -0.006457 0.352202 -0.108240 -0.113091 0.339946 -0.154687 -0.167876 -0.153207 -0.154797 -0.007326 -0.007722 -0.006931
polarizability: 8.67917599e+02 2.23438021e+01 4.13779520e+02 -3.38680849e+00 -1.58374481e+01 1.91922236e+02
1716.lowfreq: -3.2231 -0.0009 -0.0004 0.0011 1.8471 6.4624 10.4219 17.0286 25.7347
frequency: 10.2663 16.8674 25.7201 30.6104 44.8044 50.7225 68.1758 76.3723 80.8983 94.9022 104.1401 124.5881 138.8174 153.8702 173.7648 180.6442 188.6086 215.8766 229.3228 244.5104 261.6290 285.3744 298.4921 329.8436 344.9855 365.4860 377.2965 393.2885 403.7696 407.5844 416.3245 419.2423 421.5081 424.1987 426.4511 445.8081 471.2709 479.6955 490.1731 505.5559 539.0821 546.3896 572.1811 600.5784 608.3865 613.4700 626.2015 634.0354 636.0933 660.0344 664.8055 668.6793 679.4196 701.4930 709.9848 719.0362 734.6105 738.9092 752.7802 761.9089 777.6737 783.9684 796.2548 812.3816 813.4717 841.7463 850.6368 851.9835 854.4196 865.7630 872.2285 881.8811 905.7196 916.0950 918.0116 923.1831 927.3368 949.5605 969.8867 975.1735 980.3317 985.8963 988.1269 990.7227 995.8080 996.2600 997.9084 1002.1305 1003.9285 1009.7044 1015.2806 1018.0116 1037.4976 1039.8524 1078.6623 1086.2238 1086.6225 1123.0124 1127.2251 1154.3471 1161.0922 1170.2695 1174.6564 1182.9426 1190.2545 1193.5601 1199.4265 1207.4733 1246.8206 1255.0253 1287.0765 1287.8586 1291.7728 1303.3033 1306.0812 1314.4131 1316.5754 1330.2092 1356.3048 1366.5817 1375.9336 1391.9437 1395.4878 1415.1392 1415.5712 1426.3462 1433.8202 1437.6410 1448.1298 1471.7395 1474.5229 1485.3801 1506.3223 1512.3519 1518.3450 1538.2181 1551.1535 1560.9860 1571.4331 1584.1677 1587.1982 1598.5064 1608.5043 1611.7952 1615.7770 1620.9769 1625.5457 3066.9703 3124.5292 3127.9621 3132.2269 3136.7869 3137.1542 3137.5121 3142.0644 3142.6628 3144.1296 3150.3467 3152.8216 3154.9322 3162.1002 3162.3826 3164.6327 3166.3994 3166.6958 3170.2713 3173.5972 3182.1228
redmass: 6.1492 6.6268 5.2752 5.5181 5.7950 5.6312 6.2381 4.6893 5.8185 5.7225 4.3979 5.3928 6.2390 7.2306 6.9599 6.4346 6.0116 4.7371 6.0275 6.1159 5.7279 5.9059 5.7000 7.2103 6.0110 6.8034 5.9927 4.2844 2.8642 2.9523 9.9045 3.6507 4.6077 4.2535 4.7233 7.2035 10.2812 4.5256 3.7278 3.6380 3.6532 4.4559 3.5760 6.8173 6.8574 6.5253 6.4471 6.5356 6.9068 4.3651 6.2405 5.6366 4.3576 1.7614 4.8336 2.7930 3.0457 3.9239 3.3388 2.8898 4.9982 2.9706 1.5944 3.9963 1.8533 1.3096 1.2557 1.5456 1.3387 1.7701 2.1944 4.4716 2.9402 3.9448 2.2548 1.4504 1.4606 1.8378 1.3901 1.4527 1.3342 1.9051 1.6881 1.9120 5.4465 1.3643 1.3901 1.4613 3.4238 2.9348 1.3714 2.6427 2.1119 1.9057 2.0589 1.6219 2.4506 1.3961 1.3657 2.9698 2.2300 1.1390 1.0533 1.2520 1.1790 1.3810 1.3862 1.1900 1.8869 2.1890 3.0842 2.2202 3.2138 2.9898 1.4381 1.5447 1.4255 2.9757 2.9119 4.0871 8.6811 5.0839 7.2561 4.1198 5.8227 3.6825 3.7784 2.3842 2.8238 2.7855 2.1566 3.3983 3.4091 2.9609 7.9117 6.7150 5.8898 6.4605 7.4435 6.9413 6.3510 4.0958 5.3342 5.9473 6.1154 6.7507 2.4617 1.0828 1.0847 1.0875 1.0872 1.0881 1.0891 1.0864 1.0910 1.0885 1.0885 1.0963 1.0905 1.0952 1.0964 1.0954 1.0948 1.0967 1.1009 1.0939 1.0997 1.0960
irintensity: 0.1511 0.0304 0.7555 0.1865 0.4070 4.0192 1.6576 5.1994 1.2484 1.0377 2.5177 2.5441 3.3200 1.7018 0.5521 1.1454 2.9124 2.6131 0.1794 1.8837 8.6704 0.3613 3.0177 3.1026 1.5391 5.6977 5.2066 1.3209 0.1176 0.1302 20.5932 0.9521 16.8329 6.5072 2.4465 2.6629 4.5155 11.3488 1.3749 15.6716 3.8284 19.9238 0.3163 1.3765 3.6095 0.2881 3.4118 3.0314 4.0585 6.7811 8.4908 5.3333 12.5229 42.4252 14.0996 40.7994 12.8473 17.8822 77.2324 61.5784 11.7182 10.1349 6.4663 18.8355 62.3740 14.5351 0.7089 21.8622 6.2433 38.5369 7.5865 53.1756 56.2191 210.2172 44.1310 1.9412 3.8995 2.0111 1.7899 1.4940 0.3347 5.6101 10.8223 1.3827 18.2584 0.9211 4.5722 8.4937 30.5725 26.1585 0.0475 2.8111 0.6983 2.2759 23.7567 8.5674 1.8672 9.9275 15.9164 16.0060 14.4460 10.0341 0.0895 114.2252 41.8472 50.8635 42.6450 14.4277 10.4931 0.3124 1156.9575 44.4196 113.2362 149.4406 13.2413 28.0211 31.4353 777.3567 15.3228 12.0214 0.4559 23.3121 17.2347 17.2918 12.8155 22.7049 3.5217 6.9578 11.7793 1.4333 10.2305 243.5036 144.4533 19.6177 286.9649 286.2324 86.9061 141.4684 39.4925 45.3481 2.2742 585.4920 44.6566 6.0326 96.2969 55.6977 35.8625 229.9091 11.2295 1.1315 16.5962 12.5858 7.7034 3.3356 7.2470 9.2248 16.4670 31.0378 8.6537 17.4229 4.0214 5.7804 4.2771 11.9552 28.0605 4.1838 32.8276 6.3958
temp: 298.150 k
press: 1.00000 atm
elementType: 8 8 8 7 6 6 6 6 6 6 6 6 6 6 6 6 6 6 6 6 6 6 6 6 6 6 6 6 6 6 6 6 6 6 6 6 6 1 1 1 1 1 1 1 1 1 1 1 1 1 1 1 1 1 1 1 1 1
symmnumber: 1
zpe: 1158089.2 jmol-1
zpe.correction: 0.441093 hartree
zpe.thermalcorrener: 0.469609 hartree
zpe.thermalcorrenthalpy: 0.470553 hartree
zpe.thermalcorrgfe: 0.378857 hartree
zpe.sumelectzpe: -1548.120496 hartree
zpe.sumelectthermal: -1548.091981 hartree
zpe.sumelectthermalent: -1548.091036 hartree
zpe.sumelectthermalfe: -1548.182732 hartree
dipole: 0.3035 2.8311 0.2160
dipole: 2.8555
quadrupole: -172.9573 -223.7848 -211.3336
quadrupole: 36.4859 2.5630 -5.9110
quadrupole: 29.7346 -21.0929 -8.6417 36.4859 2.5630 -5.9110
hfenergy: -1548.5615892 hartree
pointgroup: C01 [X(C33H21N1O3)]
dipole: 0.102154 -1.0110776 0.4789808 debye
polarizability: 866.784085|-33.9735487|346.4133994|-1.4505883|-103.4471351|260.4218708 unknown
InChI: InChI=1S/C33H21NO3/c35-31(23-15-13-22(14-16-23)21-7-2-1-3-8-21)24-17-19-25(20-18-24)34-29-12-6-11-28-30(29)33(37)27-10-5-4-9-26(27)32(28)36/h1-20,34H
charge 0 multiplicity 1
58 atoms
O  -4.71886 1.714159 -0.783138
O  -7.088255 -2.677485 1.58302
O  3.321912 3.318786 -1.807849
N  -2.373253 0.891141 -0.050256
C  -4.42537 -0.33075 0.479789
C  -5.056937 -1.449942 1.120379
C  -2.985129 -0.185793 0.5797
C  -6.707767 0.434143 -0.366642
C  -7.337276 -0.68811 0.244774
C  -5.239478 0.654525 -0.249821
C  -6.53699 -1.675007 1.024381
C  -4.303266 -2.37782 1.863085
C  -2.254929 -1.124154 1.376976
C  -2.906772 -2.195074 2.003288
C  -7.48995 1.364076 -1.096511
C  -8.736883 -0.867473 0.118735
C  -1.003369 1.137898 -0.288397
C  -8.881014 1.177458 -1.219921
C  -9.506993 0.05923 -0.610999
C  1.720536 1.799458 -0.862123
C  -0.033843 0.112023 -0.475937
C  -0.597724 2.498032 -0.435174
C  1.306276 0.44411 -0.747329
C  0.735058 2.817116 -0.726924
C  4.283504 1.319176 -0.885831
C  3.118382 2.207241 -1.217812
C  6.616887 -0.236515 -0.276109
C  5.452667 1.413563 -1.688172
C  4.305884 0.452944 0.240901
C  7.825151 -1.051754 0.032638
C  6.591099 0.644617 -1.395813
C  5.453832 -0.306066 0.539802
C  8.665422 -1.533564 -1.009837
C  8.172908 -1.369682 1.375353
C  9.810393 -2.305542 -0.721115
C  9.317672 -2.141436 1.665337
C  10.143174 -2.614085 0.618495
H  -4.826479 -3.215152 2.333175
H  -1.184199 -0.977047 1.533917
H  -3.074406 1.566008 -0.440775
H  -2.324609 -2.889953 2.617786
H  -6.983388 2.218918 -1.554153
H  -9.191288 -1.738017 0.60207
H  -9.480613 1.89743 -1.786942
H  -10.588592 -0.082214 -0.708069
H  -0.335399 -0.939095 -0.470623
H  -1.34182 3.292512 -0.308869
H  2.025721 -0.361579 -0.925381
H  1.047103 3.858563 -0.855405
H  5.447115 2.11327 -2.530334
H  3.43388 0.391807 0.900218
H  7.485454 0.750658 -2.019579
H  5.438941 -0.980037 1.403439
H  8.40388 -1.329341 -2.054305
H  7.563485 -0.981761 2.199471
H  10.437729 -2.673435 -1.540631
H  9.571568 -2.365336 2.707441
H  11.032519 -3.212944 0.843306
