program: Gaussian 09
title: 000091728
version: EM64L-G09RevD.01
frameworkgroup: C1[X(C12H5Cl5)]
method: RPBEPBE
basis: SDD
operation: Freq
keyword: #pfreq=noraman
keyword: PBEPBE/SDD
title: #p freq=noraman PBEPBE/SDD
converged: NO NO NO NO
title: Mulliken charges:
elementType: Cl Cl Cl Cl Cl C C C C C C C C C C C C H H H H H
charge: 0.015733 0.003730 0.003726 0.045098 -0.002431 0.330992 0.393795 -0.364293 -0.364283 -0.293037 -0.375065 -0.045015 -0.045016 -0.099666 -0.086484 -0.211724 -0.228362 0.278300 0.278301 0.258859 0.243357 0.263484
chargesum: 0.00000
title: Mulliken charges with hydrogens summed into heavy atoms:
elementType: Cl Cl Cl Cl Cl C C C C C C C C C C C C
charge: 0.015733 0.003730 0.003726 0.045098 -0.002431 0.330992 0.393795 -0.085993 -0.085982 -0.293037 -0.116206 -0.045015 -0.045016 -0.099666 -0.086484 0.031633 0.035122
polarizability: 2.47288907e+02 3.85545433e-03 1.44320909e+02 -1.27304312e+01 -1.03385122e-02 1.39090917e+02
1716.lowfreq: -21.4957 -5.1159 -1.2827 -0.0021 -0.0018 -0.0011 3.5631 40.9943 42.3621
frequency: -21.4857 40.9839 42.3347 75.0196 102.9283 160.3514 184.0158 185.7987 193.1912 196.6599 205.6779 226.0891 268.7861 303.9718 334.0500 370.3502 410.5207 431.3368 462.5028 474.6828 506.3618 512.4573 520.6083 587.1933 623.3536 681.3337 701.0871 722.0127 723.2289 765.3236 796.8688 845.0354 884.6638 894.5223 907.8430 976.3399 1003.6870 1016.8124 1061.7967 1114.1176 1146.8950 1152.9725 1194.9284 1198.3652 1287.5161 1337.3190 1348.1219 1366.3734 1396.6124 1411.8550 1452.3291 1541.0340 1559.3406 1578.9493 1594.7353 3144.4923 3158.0837 3164.7061 3167.1041 3174.8026
redmass: 11.3301 14.8935 17.0875 30.2471 9.9228 15.5890 15.7901 4.9024 29.4811 18.0440 5.4082 13.3701 7.5351 8.9620 29.6426 8.2476 6.8196 8.4004 9.2194 8.0354 3.9992 5.3467 9.9425 5.2880 6.8630 8.1748 3.8017 6.8420 3.4616 4.0847 1.8460 8.1769 1.5746 1.3506 1.3694 1.3383 8.0353 6.4511 3.4591 1.8567 2.1699 1.6949 1.6398 1.4072 2.4443 5.8882 10.7375 3.7224 2.8948 2.6128 3.7585 8.7858 6.4909 7.0374 7.2980 1.0872 1.0926 1.0927 1.0938 1.0999
irintensity: 0.5555 0.2248 0.0045 0.0400 0.1138 0.0120 0.2845 0.0078 0.0170 0.0175 0.3489 0.1672 2.3602 1.1477 0.1396 5.5872 6.5402 7.5920 3.0917 1.4728 0.0196 0.0132 24.3756 0.2308 4.0603 11.4232 11.9117 29.9052 1.5414 134.2007 9.5227 18.5941 18.3410 0.2587 0.2343 0.3141 4.2176 36.6680 16.8878 5.2481 41.7865 11.1523 14.1950 4.3981 6.6700 15.8546 2.4913 31.8215 60.3200 98.5699 0.6841 75.3749 15.2293 26.5250 1.1599 2.7818 3.8363 0.1216 0.0533 8.1613
temp: 298.150 k
press: 1.00000 atm
elementType: 17 17 17 17 17 6 6 6 6 6 6 6 6 6 6 6 6 1 1 1 1 1
symmnumber: 1
zpe: 340280.4 jmol-1
zpe.correction: 0.129606 hartree
zpe.thermalcorrener: 0.144444 hartree
zpe.thermalcorrenthalpy: 0.145388 hartree
zpe.thermalcorrgfe: 0.085685 hartree
zpe.sumelectzpe: -2759.387699 hartree
zpe.sumelectthermal: -2759.372861 hartree
zpe.sumelectthermalent: -2759.371917 hartree
zpe.sumelectthermalfe: -2759.431620 hartree
dipole: -2.4707 -0.0015 3.2942
dipole: 4.1178
quadrupole: -135.9622 -132.9397 -126.0273
quadrupole: 0.0046 -9.6729 -0.0038
quadrupole: -4.3191 -1.2966 5.6158 0.0046 -9.6729 -0.0038
hfenergy: -2759.5173048 hartree
pointgroup: C01 [X(C12H5Cl5)]
dipole: -1.0618426 0.0009302 -1.2235395 debye
dipolederiv: -0.172309 0.0001405 -0.1986534 0.0001385 -0.0181818 0.0003772 -0.1948201 0.00039 -0.5682581 -0.2429147 0.2577231 -0.0145872 0.3284357 -0.6005077 0.0228176 -0.0234183 0.0257779 -0.0257442 -0.2429456 -0.2577227 -0.0148847 -0.3284252 -0.6004246 -0.023479 -0.0237898 -0.0264285 -0.0258023 -0.7253508 0.0000571 -0.0656723 0.0000682 -0.0072654 -0.0000023 -0.0820083 -0.0000022 -0.0014481 -0.465343 -0.0002219 0.3165157 -0.0002796 -0.0295328 0.0002512 0.4096698 0.0002617 -0.4011034 0.3659742 0.0000123 -0.0204328 -0.0000335 0.1858332 0.0001475 0.0113758 0.0001356 -0.0473165 0.3543927 0.0000064 -0.0238901 0.0000556 -0.0707548 0.0000275 -0.0708796 0.0000381 -0.1247016 -0.3078542 -0.1639776 -0.0042545 -0.0318012 -0.1959705 -0.00152 -0.0345269 -0.0000068 -0.0723102 -0.3078517 0.163992 -0.0040633 0.0318579 -0.1959751 0.0013816 -0.0344709 -0.0001363 -0.0722984 -0.0464327 -0.0002583 0.380311 -0.0002702 -0.0355566 -0.0005178 0.412242 -0.0005147 0.721628 -0.1800627 0.000026 -0.0263369 -0.0000085 -0.1255749 -0.0001129 -0.0075001 -0.0001157 0.0217363 0.1772584 -0.4352199 0.0145218 -0.4218218 0.911143 -0.0296535 0.0305061 -0.0453021 -0.015322 0.1772919 0.4352414 0.0150241 0.4218239 0.9110177 0.0307115 0.0310076 0.0463507 -0.0152317 0.9414859 -0.0001018 0.1037621 -0.0001052 -0.3820302 -0.0001954 0.112494 -0.0001931 -0.0416197 0.5538685 0.0003595 -0.520399 0.0004871 -0.0341635 -0.0003368 -0.7280027 -0.0003405 0.4498362 0.0233183 -0.0000164 0.0155173 0.0000095 -0.1354433 -0.0001442 0.020843 -0.0001712 0.0807691 -0.0981254 -0.0000543 0.0623955 -0.0001447 -0.1023693 0.0000254 0.1681234 0.0000309 -0.1646774 0.0818466 0.0507095 -0.0135631 0.0660624 0.0315945 0.0022579 -0.0111588 0.0006013 0.137751 0.0818413 -0.050693 -0.0136171 -0.0660508 0.0316025 -0.0023805 -0.0112312 -0.0007102 0.1377493 0.0412715 -0.0000647 0.0847915 -0.0000716 0.1379697 0.0001124 0.099556 0.0000992 0.005721 0.0291472 0.0000403 -0.0523801 0.0000393 0.1604819 0.0001626 -0.0643063 0.000177 -0.0669067 -0.0385067 0.0000225 -0.0201044 0.0000343 0.1641081 0.0000702 -0.0097048 0.0000593 0.0875496 unknown
polarizability: 248.5484495|-0.0036579|144.3209145|4.919088|-0.0080005|137.8313684 unknown
InChI: InChI=1S/C12H5Cl5/c13-8-3-1-2-7(11(8)16)6-4-9(14)12(17)10(15)5-6/h1-5H
charge 0 multiplicity 1
22 atoms
Cl -1.429565 -0.001646 2.332417
Cl 3.272966 -2.799574 0.083884
Cl 3.273105 2.799349 0.087088
Cl 4.923322 -0.000281 0.276564
Cl -4.642851 -0.001275 1.810405
C  0.30553 0.000149 -0.250759
C  -1.183329 0.000294 -0.450097
C  1.015179 1.221811 -0.169646
C  1.015115 -1.221638 -0.171055
C  -2.084507 -0.000487 0.647681
C  -1.715596 0.001327 -1.764569
C  2.415131 -1.216865 -0.011562
C  2.415192 1.216786 -0.010156
C  3.135001 -0.000107 0.071852
C  -3.48294 -0.000328 0.427317
C  -3.111181 0.001549 -1.982249
C  -3.998929 0.00064 -0.885523
H  0.484192 2.176633 -0.225984
H  0.484085 -2.176373 -0.228472
H  -1.022918 0.001981 -2.612444
H  -3.510408 0.002352 -3.001308
H  -5.082796 0.000804 -1.037384
