program: Gaussian 09
title: 000091744
version: EM64L-G09RevD.01
frameworkgroup: C1[X(C12H18ClNO2S)]
method: RPBEPBE
basis: SDD
operation: Freq
keyword: #p
keyword: freq=noraman
keyword: PBEPBE/SDD
title: #p freq=noraman PBEPBE/SDD
converged: YES YES NO NO
title: Mulliken charges:
elementType: Cl S O O N C C C C C C C C C C C C H H H H H H H H H H H H H H H H H H
charge: -0.021346 0.268358 -0.281350 -0.232081 -0.254096 -0.065657 0.271972 -0.293216 -0.730365 0.520394 -0.243426 0.222404 -0.729889 -0.795037 -0.770040 -0.719878 -0.496554 0.264822 0.243843 0.191743 0.216507 0.219394 0.269157 0.276038 0.239840 0.232267 0.239049 0.243196 0.248217 0.247049 0.290538 0.285044 0.211336 0.233534 0.198233
chargesum: 0.00000
title: Mulliken charges with hydrogens summed into heavy atoms:
elementType: Cl S O O N C C C C C C C C C C C C
charge: -0.021346 0.268358 -0.281350 -0.232081 -0.254096 0.199165 0.271972 0.142371 -0.025307 0.520394 -0.243426 0.222404 -0.453851 -0.083881 -0.031579 -0.144296 0.146550
polarizability: 1.79406502e+02 -1.81066134e+01 1.69696814e+02 3.79174429e+00 9.83335183e+00 1.47572040e+02
1716.lowfreq: -8.2647 -2.5986 -0.0018 -0.0002 0.0009 8.4078 20.6593 26.6140 53.2492
frequency: 20.3229 26.5372 53.2093 59.2497 62.5598 78.8005 90.1108 94.1815 109.0710 128.0518 135.4586 163.3905 174.2551 216.0958 219.6236 233.8264 251.4878 261.5905 263.0286 291.2119 326.3816 333.7914 376.7840 391.1669 440.7279 459.4593 481.7192 534.5207 546.6168 559.8326 588.6314 673.7359 706.8942 731.2893 734.0364 748.3860 796.9806 877.9552 899.5411 910.9274 923.8739 927.5553 963.3450 982.4388 1026.4936 1040.3512 1041.2106 1058.6892 1074.5429 1112.3610 1127.0509 1147.5876 1152.5531 1156.0460 1170.6884 1175.8346 1220.0384 1230.5990 1244.9528 1303.8667 1328.5940 1340.2393 1368.2195 1388.5206 1395.6885 1401.8366 1405.8131 1422.7819 1436.7947 1458.6044 1459.6749 1463.0191 1464.9556 1465.5326 1468.1024 1472.5413 1480.6578 1485.9302 1525.1568 1579.2678 1609.5492 2922.2804 2931.1346 2978.2555 2982.9815 2996.2629 2999.5952 3004.3279 3028.5067 3050.4807 3056.9896 3058.9640 3089.4162 3092.4278 3094.6670 3104.0115 3106.7781 3126.6227 3227.2610
redmass: 5.2139 3.5462 4.6974 2.7635 3.7921 2.8662 1.2453 2.6564 2.7271 1.7284 2.2551 2.3358 3.2834 4.6139 1.1482 1.3755 3.4222 3.7295 4.0600 3.7381 3.3044 4.4251 4.9534 4.5313 3.9886 2.7585 4.0145 6.3177 4.1209 3.4528 4.7562 5.7512 5.9759 1.5055 2.8761 4.9367 4.5375 2.9382 4.4439 1.9193 1.3124 3.1678 2.5755 1.8480 1.9285 1.4233 1.4792 2.7763 3.3216 1.2760 2.2668 1.7096 1.5669 1.1850 1.6624 2.2017 1.5611 1.6519 2.1136 2.3506 1.5835 1.5087 1.4025 1.3963 2.2509 1.3603 1.2257 1.1107 1.1408 1.0542 1.0821 1.1077 1.0625 1.1036 1.0767 1.0662 1.0547 1.0698 4.2118 6.2457 9.7139 1.0491 1.0436 1.0374 1.0381 1.0371 1.0989 1.1023 1.0869 1.0579 1.0971 1.0961 1.0984 1.0988 1.0986 1.0976 1.0990 1.1059 1.0966
irintensity: 1.0158 1.0199 0.3486 0.1708 2.8041 5.6057 0.0467 5.5309 0.2980 1.3081 1.7479 2.5616 2.4269 1.9580 2.4188 1.1379 1.2110 0.0232 4.1368 3.1450 4.0306 9.9151 2.6808 6.4396 1.7570 3.1652 1.0947 1.8725 11.9498 3.7833 10.3233 6.9559 33.7144 13.1492 28.8949 20.7659 12.3464 2.2442 15.8961 6.6136 0.1769 4.9120 1.8886 5.8821 2.4197 6.9076 6.9219 49.4680 105.8714 0.2186 53.0496 8.8267 7.0828 3.6635 4.5224 15.1525 82.3564 65.7198 27.7735 69.5215 17.9526 4.2097 2.5100 5.9344 33.0170 16.0765 14.9583 19.3538 2.1975 8.0010 11.4743 6.2344 25.1545 26.3531 13.7688 6.7536 11.4304 6.7058 2.0338 28.9870 200.2504 65.3782 81.8215 24.1340 22.2511 19.7074 54.6527 34.0830 7.8036 12.2975 11.4368 21.0274 13.1101 30.4496 18.5024 33.5043 11.2418 3.9031 0.3676
temp: 298.150 k
press: 1.00000 atm
elementType: 17 16 8 8 7 6 6 6 6 6 6 6 6 6 6 6 6 1 1 1 1 1 1 1 1 1 1 1 1 1 1 1 1 1 1
symmnumber: 1
zpe: 732138.3 jmol-1
zpe.correction: 0.278857 hartree
zpe.thermalcorrener: 0.299286 hartree
zpe.thermalcorrenthalpy: 0.300230 hartree
zpe.thermalcorrgfe: 0.227516 hartree
zpe.sumelectzpe: -1530.048537 hartree
zpe.sumelectthermal: -1530.028107 hartree
zpe.sumelectthermalent: -1530.027163 hartree
zpe.sumelectthermalfe: -1530.099877 hartree
dipole: 1.0609 -4.5659 -1.3428
dipole: 4.8761
quadrupole: -109.8448 -135.8952 -108.0745
quadrupole: 1.7528 10.7424 0.2433
quadrupole: 8.0934 -17.9570 9.8637 1.7528 10.7424 0.2433
hfenergy: -1530.3273937 hartree
pointgroup: C01 [X(C12H18Cl1N1O2S1)]
dipole: -0.2073114 1.8162215 -0.5818951 debye
polarizability: 176.3742232|-18.0746715|172.7750355|-2.3852646|-11.2083999|147.5260978 unknown
InChI: InChI=1S/C12H18ClNO2S/c1-8-7-17-10(3)12(8)14(11(15)5-13)9(2)6-16-4/h7,9H,5-6H2,1-4H3
charge 0 multiplicity 1
35 atoms
Cl -1.751036 -3.880635 -0.557341
S  -2.502702 2.431099 -1.269286
O  3.760492 0.294371 0.495587
O  0.75626 -2.509819 0.396688
N  0.06883 -0.28638 0.240791
C  1.378769 0.157663 0.844762
C  -0.980651 0.657484 -0.053614
C  2.502852 0.04569 -0.211568
C  1.31618 1.569937 1.444163
C  -2.022277 0.999508 0.91461
C  -1.082896 1.317307 -1.276041
C  -0.122312 -1.664636 0.071272
C  -2.90679 1.933614 0.411888
C  -2.129294 0.375003 2.287301
C  -0.215172 1.206143 -2.497432
C  -1.468028 -2.040979 -0.579896
C  4.929802 0.025552 -0.337339
H  1.621805 -0.579172 1.633123
H  2.501554 -0.973851 -0.64875
H  2.364752 0.799836 -1.018844
H  0.604861 1.635232 2.284748
H  1.031289 2.324694 0.689417
H  2.322907 1.818512 1.818799
H  -3.776084 2.375957 0.895317
H  -1.209224 0.533491 2.878127
H  -2.975152 0.800753 2.852383
H  -2.281834 -0.719387 2.226606
H  -0.817604 1.079715 -3.415048
H  0.415941 2.104157 -2.637926
H  0.454939 0.334528 -2.403799
H  -2.324817 -1.585048 -0.063216
H  -1.486252 -1.735306 -1.638021
H  4.948799 -1.031421 -0.676907
H  5.81091 0.223689 0.293028
H  4.958285 0.688999 -1.228582
