program: Gaussian 09
title: 000091746
version: EM64L-G09RevD.01
frameworkgroup: C1[X(C20H27NO3)]
method: RPBEPBE
basis: SDD
operation: Freq
keyword: #p
keyword: freq=noraman
keyword: PBEPBE/SDD
title: #p freq=noraman PBEPBE/SDD
converged: YES YES NO NO
title: Mulliken charges:
elementType: O O O N C C C C C C C C C C C C C C C C C C C C H H H H H H H H H H H H H H H H H H H H H H H H H H H
charge: -0.369815 -0.263615 -0.217833 -0.326467 -0.216680 -0.560038 -0.554593 0.274321 0.169388 0.054695 -0.080542 0.286838 0.303970 0.374404 -0.602987 -0.625544 0.476775 -0.871008 -0.864219 -0.479588 -0.816127 -0.689918 -0.239553 -0.672021 0.231361 0.257796 0.256698 0.231819 0.260134 0.233604 0.231015 0.236919 0.233424 0.234885 0.234244 0.240025 0.225804 0.227694 0.270522 0.223249 0.224574 0.232788 0.401313 0.219701 0.222198 0.253855 0.218003 0.220998 0.216942 0.234857 0.235735
chargesum: 0.00000
title: Mulliken charges with hydrogens summed into heavy atoms:
elementType: O O O N C C C C C C C C C C C C C C C C C C C C
charge: -0.369815 -0.263615 -0.217833 0.074846 0.014681 -0.045544 -0.062641 0.274321 0.169388 0.054695 -0.080542 0.286838 0.303970 0.374404 -0.369383 -0.394529 0.476775 -0.165780 -0.164146 0.018628 -0.135517 0.005836 0.199448 0.015513
polarizability: 3.64340459e+02 3.12708866e+00 2.01226913e+02 -6.52054323e+00 4.02497265e+00 1.94392535e+02
1716.lowfreq: -7.4245 -0.0008 0.0006 0.0008 1.6965 5.2161 17.1013 22.3743 25.9560
frequency: 16.7996 22.3332 25.9450 34.0635 38.2816 51.5649 61.7339 76.1789 87.3052 96.5157 126.1521 146.7149 162.0272 169.3064 181.3842 197.9690 203.3949 211.0676 227.0261 232.3137 233.7340 246.4079 263.7828 275.5735 279.6681 321.5433 328.2784 342.4356 381.1497 388.9832 418.1494 436.6745 441.9368 482.3478 497.6516 518.6914 524.7736 542.1552 551.0305 565.0863 570.2530 588.0300 623.1373 630.4223 650.5888 724.8889 748.6167 759.1487 797.9340 818.0373 821.5412 857.6694 866.3605 889.9278 895.7606 897.6339 916.4291 929.8120 962.2569 1005.8071 1011.6499 1016.6055 1018.4268 1025.6560 1032.6842 1035.5244 1040.5154 1049.8477 1050.4842 1062.0066 1069.6896 1094.9163 1107.2029 1117.5271 1123.9141 1136.1391 1144.1910 1150.5317 1207.3704 1228.0042 1248.4996 1251.6113 1261.5060 1264.3822 1280.4405 1295.2524 1307.6293 1316.2400 1329.7528 1340.6761 1346.8704 1364.3770 1379.3291 1386.6895 1396.4989 1398.7598 1399.2678 1403.8889 1415.0154 1419.8236 1438.4235 1444.7459 1445.4945 1451.3438 1462.1303 1471.5718 1473.0752 1476.0244 1479.7136 1480.3737 1483.6844 1485.4710 1488.1100 1491.2645 1497.3566 1514.2936 1534.3045 1554.4887 1584.9109 1620.0527 2116.2290 2970.3535 2973.0403 2978.4209 2978.4844 2988.9119 2992.8594 3000.0459 3009.2415 3022.6865 3028.4503 3039.9550 3045.9394 3053.1031 3058.9009 3061.3138 3072.3080 3078.0953 3082.0090 3086.5259 3087.1640 3098.0058 3101.3373 3107.2696 3108.7994 3112.3897 3118.3017
redmass: 2.5417 4.1216 1.0188 4.0384 3.6686 2.6924 3.9842 3.2570 2.8298 3.1110 4.8589 3.5352 4.8778 5.0691 2.6216 1.0986 1.3396 1.2639 1.6530 2.4279 1.1852 3.6187 6.1591 4.0217 2.5641 3.7370 2.8459 2.8919 3.8720 2.7916 2.7721 4.1960 4.8966 5.7053 3.7017 4.0157 3.0985 4.1185 4.6007 3.6761 3.9502 3.5372 3.6527 4.0507 3.5160 4.9214 2.0270 3.5867 1.8124 2.7686 1.0896 1.6299 1.3055 2.6518 1.3162 2.8631 2.7133 2.6441 3.4326 2.1990 3.9026 1.8415 1.8362 1.9619 2.8786 1.5868 1.5683 1.6783 2.2102 1.7318 3.2629 2.0220 1.2356 3.2578 2.0503 1.3879 1.2762 2.5617 1.4201 1.5476 1.1645 1.6097 1.3863 1.4239 1.9164 1.8597 5.8850 1.4067 1.3749 2.9849 3.1446 1.4680 1.2939 1.6775 1.2314 1.2496 1.2527 1.2697 2.4145 2.7412 1.0984 1.3674 1.5821 1.4036 1.0394 1.0594 1.0625 1.0972 1.0497 1.0557 1.0920 1.0590 1.0875 1.0781 1.3575 4.8500 3.5849 8.0222 6.3854 5.8520 1.1028 1.0380 1.0382 1.0555 1.0402 1.0642 1.0344 1.0363 1.0624 1.0778 1.0616 1.1086 1.0976 1.0956 1.0942 1.0966 1.0999 1.0976 1.0995 1.1006 1.0978 1.0988 1.0981 1.0907 1.1018 1.0916 1.1024
irintensity: 2.0517 0.7600 0.5048 0.6519 0.0366 2.5410 2.3632 1.0356 0.2324 1.8205 0.4750 1.5484 1.1796 4.9249 5.6123 0.9168 0.1070 0.6181 0.2021 19.6122 0.6533 6.6852 5.9661 27.7494 0.1642 10.6038 10.6752 49.6698 49.3348 89.7830 1.3747 41.1503 18.2857 7.6928 1.3682 0.5064 0.2742 1.4579 5.7023 4.4987 2.7475 12.1204 57.4391 20.0267 117.2964 12.3399 119.5164 5.3783 6.8955 25.9244 5.6031 0.3653 20.7459 13.7984 1.4497 201.7570 8.6006 12.5017 0.4342 0.4604 7.7616 5.8078 13.6868 6.2221 110.0224 7.9549 1.9711 22.4034 4.9008 23.4979 12.8087 5.0777 61.8727 7.1767 26.4694 14.5012 5.6121 5.6965 1.0492 13.9789 0.5011 7.5445 3.5445 8.3469 69.4415 14.8268 0.6990 8.9840 1.1310 20.1223 23.7308 40.3665 23.3841 17.4093 8.3284 26.0146 41.6221 7.0021 1.4523 240.0770 5.5725 12.6358 4.8359 85.4757 13.0348 11.6797 26.3761 6.7790 15.7041 12.2567 16.4233 3.0738 28.3243 11.7497 54.1715 277.4854 160.3510 344.8482 8.0796 19.1962 186.7241 33.7634 46.8283 44.9511 27.7706 10.0638 35.3596 21.9828 10.9915 14.6160 15.7451 26.4615 16.2190 22.6582 24.8960 10.2704 13.5341 24.4846 16.9759 28.3222 30.9864 24.5777 17.9008 34.3148 34.0924 24.8101 6.8735
temp: 298.150 k
press: 1.00000 atm
elementType: 8 8 8 7 6 6 6 6 6 6 6 6 6 6 6 6 6 6 6 6 6 6 6 6 1 1 1 1 1 1 1 1 1 1 1 1 1 1 1 1 1 1 1 1 1 1 1 1 1 1 1
symmnumber: 1
zpe: 1113357.0 jmol-1
zpe.correction: 0.424055 hartree
zpe.thermalcorrener: 0.450117 hartree
zpe.thermalcorrenthalpy: 0.451061 hartree
zpe.thermalcorrgfe: 0.365362 hartree
zpe.sumelectzpe: -1056.913384 hartree
zpe.sumelectthermal: -1056.887322 hartree
zpe.sumelectthermalent: -1056.886378 hartree
zpe.sumelectthermalfe: -1056.972077 hartree
dipole: -1.5054 -3.0342 0.1302
dipole: 3.3897
quadrupole: -111.7270 -155.9913 -137.3607
quadrupole: 10.0535 -1.9825 -3.1724
quadrupole: 23.2993 -20.9650 -2.3343 10.0535 -1.9825 -3.1724
hfenergy: -1057.3374389 hartree
pointgroup: C01 [X(C20H27N1O3)]
dipole: -0.5985868 -1.1830081 -0.1437142 debye
polarizability: 364.2665806|3.4970099|199.6799148|-7.2563423|4.9222287|196.013412 unknown
InChI: InChI=1S/C20H27NO3/c1-6-16(21-24-7-2)20-17(22)10-15(11-18(20)23)19-13(4)8-12(3)9-14(19)5/h8-9,15,21H,6-7,10-11H2,1-5H3
charge 0 multiplicity 1
51 atoms
O  -1.893154 -1.722614 -0.942056
O  -1.223849 2.758898 0.75346
O  -5.24844 -0.547954 0.07794
N  -3.818751 -0.541936 -0.116775
C  1.190971 -0.004407 0.12618
C  0.350624 -0.829232 -0.879002
C  0.7064 1.467645 0.08796
C  2.715327 -0.151109 0.01199
C  -1.133786 -0.696278 -0.595341
C  -0.804947 1.632227 0.320589
C  -1.687559 0.491153 0.007039
C  3.45049 -0.48561 1.198576
C  3.445524 0.067892 -1.200592
C  -3.128878 0.542137 0.270265
C  4.8594 -0.60828 1.151619
C  4.858248 -0.062204 -1.19931
C  5.589347 -0.407837 -0.042274
C  2.766519 -0.709278 2.543252
C  2.802697 0.429077 -2.536433
C  -3.865963 1.696913 0.911626
C  7.099187 -0.568229 -0.078313
C  -4.336815 2.732861 -0.148183
C  -5.767035 -1.922446 -0.175031
C  -7.278469 -1.841634 0.021713
H  0.904828 -0.387825 1.12236
H  0.607351 -1.902648 -0.842204
H  0.52496 -0.495562 -1.918108
H  0.942749 1.934738 -0.888738
H  1.217988 2.081319 0.850572
H  5.399302 -0.862659 2.072879
H  5.400938 0.115416 -2.137066
H  2.18327 0.172311 2.869718
H  2.07192 -1.570885 2.522487
H  3.51796 -0.91394 3.324821
H  3.563731 0.836108 -3.224711
H  2.364705 -0.459141 -3.031035
H  2.004201 1.184403 -2.447268
H  -4.743974 1.295513 1.447066
H  -3.190714 2.205553 1.614472
H  7.538828 -0.062227 -0.955515
H  7.57249 -0.151339 0.829071
H  7.386119 -1.636505 -0.134094
H  -3.158813 -1.35245 -0.601291
H  -4.991171 2.265122 -0.904913
H  -4.904388 3.538714 0.349899
H  -3.465486 3.188336 -0.646922
H  -5.502639 -2.221277 -1.208491
H  -5.292776 -2.622665 0.539768
H  -7.727757 -2.83549 -0.153679
H  -7.526122 -1.524391 1.048863
H  -7.729889 -1.125885 -0.686041
