program: Gaussian 09
title: 000091726
version: EM64L-G09RevD.01
frameworkgroup: C1[X(C12H12N2O3)]
method: RPBEPBE
basis: SDD
operation: Freq
keyword: #p
keyword: freq=noraman
keyword: PBEPBE/SDD
title: #p freq=noraman PBEPBE/SDD
converged: YES YES NO NO
title: Mulliken charges:
elementType: O O O N N C C C C C C C C C C C C H H H H H H H H H H H H
charge: -0.249585 -0.284459 -0.242131 0.003513 -0.001445 -0.006413 -0.322844 -0.298187 -0.256354 0.335231 0.027313 -0.341881 -0.353928 -0.226119 -0.220089 -0.231979 -0.172301 0.248330 0.240300 0.211883 0.234333 0.220540 0.237615 0.231521 0.250616 0.266743 0.233604 0.231948 0.234224
chargesum: 0.00000
title: Mulliken charges with hydrogens summed into heavy atoms:
elementType: O O O N N C C C C C C C C C C C C
charge: -0.249585 -0.284459 -0.242131 0.003513 -0.001445 0.241917 0.129339 0.156686 0.212782 0.335231 0.027313 -0.091265 -0.087185 0.007485 0.011859 0.002245 -0.172301
polarizability: 2.48620382e+02 -1.44271074e+00 1.55635792e+02 5.40965417e+00 -5.09356757e-01 8.21586349e+01
1716.lowfreq: -9.8434 -3.3366 -0.0007 -0.0005 0.0004 4.0719 10.1831 27.2586 42.1264
frequency: 8.9154 27.2187 41.9351 44.4387 66.3303 101.6722 119.2694 148.6025 166.7957 227.8102 239.9458 263.4602 305.9919 307.1898 387.8896 400.8318 408.3151 484.7423 487.9640 491.6308 612.9069 614.3778 663.9867 669.0784 679.6380 697.2743 765.7385 783.8243 787.7266 850.4259 857.1665 868.5931 910.1553 933.2386 939.0802 969.7548 984.3180 987.7514 988.4907 993.0536 1004.1876 1018.4745 1047.9156 1065.8396 1089.4249 1101.2355 1116.9891 1157.7874 1175.3969 1188.1963 1193.8476 1196.0308 1244.2664 1297.4887 1309.9043 1323.4262 1325.0469 1335.1749 1373.9155 1384.1594 1431.9645 1454.9432 1469.4885 1473.2923 1483.0889 1497.4381 1586.6838 1610.5682 2172.3776 2987.5438 3004.0553 3015.4314 3035.8196 3093.0315 3101.7119 3111.4219 3130.8960 3138.2393 3149.6237 3162.3512 3172.5344
redmass: 4.3989 4.4028 4.2668 5.4384 5.7903 5.2095 8.6088 6.1521 3.4922 6.3534 2.3753 7.4152 5.4896 6.8465 4.7440 2.8302 8.1658 8.7014 3.7370 3.6838 2.3240 6.4464 7.1550 6.2743 6.9015 1.7434 6.1042 1.9266 4.3212 2.6868 1.2502 5.0895 5.1946 3.0080 1.4324 2.4870 5.5097 1.3866 6.0363 4.9854 1.3295 3.6712 2.7451 2.6747 1.6118 1.9292 2.5114 1.1383 1.0543 1.1117 1.1212 1.2636 1.2151 2.5053 1.4315 1.2443 1.4524 1.2713 1.5083 6.6696 2.5007 1.0838 1.0882 1.0976 2.5881 5.5945 6.1966 5.9307 12.6589 1.0682 1.0626 1.0568 1.0872 1.1088 1.1002 1.1028 1.0852 1.0886 1.0930 1.0962 1.1008
irintensity: 0.7816 0.6877 2.5088 1.1033 6.7442 2.0535 1.4879 1.1983 4.4519 1.6570 3.8471 0.4898 1.3077 7.8018 3.9894 0.0018 4.7985 1.1542 16.5060 39.2521 4.8060 0.1140 10.2719 11.0753 2.1755 55.8075 42.1291 45.5043 40.9623 5.1670 0.0090 37.1408 22.0216 124.3044 4.8127 15.8341 90.2752 0.3467 1.5103 316.9992 0.2965 5.9623 4.4346 92.3184 4.3674 6.7884 64.7747 2.2831 0.2851 8.7812 2.6375 12.2374 10.7914 50.4664 4.9027 2.9653 6.9473 4.7740 3.6851 0.0245 15.3860 28.0082 8.2968 1.0315 4.1282 5.7160 0.6777 0.4939 8.2258 47.9904 78.3749 37.4202 34.8532 26.1275 18.9034 30.4470 0.8168 3.4281 16.2776 18.4957 19.9141
temp: 298.150 k
press: 1.00000 atm
elementType: 8 8 8 7 7 6 6 6 6 6 6 6 6 6 6 6 6 1 1 1 1 1 1 1 1 1 1 1 1
symmnumber: 1
zpe: 577310.3 jmol-1
zpe.correction: 0.219886 hartree
zpe.thermalcorrener: 0.235653 hartree
zpe.thermalcorrenthalpy: 0.236597 hartree
zpe.thermalcorrgfe: 0.172663 hartree
zpe.sumelectzpe: -798.304235 hartree
zpe.sumelectthermal: -798.288468 hartree
zpe.sumelectthermalent: -798.287524 hartree
zpe.sumelectthermalfe: -798.351458 hartree
dipole: -0.9325 -4.2769 0.9172
dipole: 4.4724
quadrupole: -62.1494 -105.4641 -101.8688
quadrupole: 1.6039 -4.9861 -3.3651
quadrupole: 27.6780 -15.6366 -12.0414 1.6039 -4.9861 -3.3651
hfenergy: -798.5241207 hartree
pointgroup: C01 [X(C12H12N2O3)]
dipole: -0.3191214 -1.606028 0.6441571 debye
polarizability: 248.7096403|1.6911302|153.3998688|3.8150096|-12.6021606|84.3053001 unknown
InChI: InChI=1S/C12H12N2O3/c13-8-11(10-4-2-1-3-5-10)14-17-9-12-15-6-7-16-12/h1-5,12H,6-7,9H2
charge 0 multiplicity 1
29 atoms
O  -3.955486 0.708152 0.763431
O  -4.504108 -0.987782 -0.80879
O  -1.109615 0.335721 -0.367157
N  0.158551 -0.306503 -0.170446
N  0.783518 3.138715 -0.692595
C  -3.50117 0.046357 -0.467522
C  -4.980368 -0.183898 1.359366
C  -5.650059 -0.788614 0.113784
C  -2.173266 -0.696134 -0.309337
C  2.550919 0.071316 -0.044843
C  1.164041 0.565375 -0.233303
C  3.646437 0.974835 -0.106349
C  2.800987 -1.308972 0.199231
C  4.96602 0.507282 0.072813
C  4.119311 -1.768012 0.376763
C  5.208559 -0.863486 0.31488
C  0.948991 1.973605 -0.482701
H  -3.443845 0.831255 -1.243681
H  -5.639788 0.450803 1.97003
H  -4.506656 -0.963749 1.987866
H  -6.108349 -1.776614 0.275912
H  -6.3810 -0.089282 -0.334517
H  -2.037785 -1.40637 -1.144504
H  -2.124881 -1.229832 0.655727
H  3.466842 2.039593 -0.293414
H  1.956465 -2.003144 0.245939
H  5.801842 1.213259 0.023285
H  4.302723 -2.831698 0.563839
H  6.233069 -1.22548 0.453994
