program: Gaussian 09
title: 000091718
version: EM64L-G09RevD.01
frameworkgroup: C1[X(C12H6Cl4)]
method: RPBEPBE
basis: SDD
operation: Freq
keyword: #pfreq=noraman
keyword: PBEPBE/SDD
title: #p freq=noraman PBEPBE/SDD
converged: NO NO NO NO
title: Mulliken charges:
elementType: Cl Cl Cl Cl C C C C C C C C C C C C H H H H H H
charge: 0.022848 -0.015285 0.001485 -0.057889 0.499470 0.308437 -0.261898 -0.326861 -0.320400 -0.353409 -0.107521 -0.218704 -0.217661 -0.073269 -0.193866 -0.234147 0.270039 0.248586 0.267285 0.267052 0.236124 0.259584
chargesum: 0.00000
title: Mulliken charges with hydrogens summed into heavy atoms:
elementType: Cl Cl Cl Cl C C C C C C C C C C C C
charge: 0.022848 -0.015285 0.001485 -0.057889 0.499470 0.308437 -0.261898 -0.326861 -0.050361 -0.104822 -0.107521 0.048581 0.049391 -0.073269 0.042258 0.025437
polarizability: 2.17989485e+02 -5.04663866e-01 1.53920862e+02 5.55799519e+00 -1.51750692e+00 1.18777863e+02
1716.lowfreq: -8.5121 -4.0617 -0.0038 -0.0031 -0.0019 3.2705 3.9071 44.8445 55.5491
frequency: -7.6719 44.8336 55.5472 90.6185 109.3263 166.9245 175.4722 194.1845 233.5144 241.7493 277.3173 289.8808 313.5418 355.1260 393.7956 411.8011 437.4833 451.7394 522.7944 529.4106 580.3942 608.9833 631.3021 679.5090 698.5919 744.5926 757.7882 791.1675 807.9170 817.4733 890.3075 909.9782 943.2163 979.6051 983.1028 1011.3078 1073.1538 1086.3405 1100.8018 1132.7773 1162.6519 1178.3760 1247.3530 1284.0777 1339.7240 1364.7223 1369.7614 1405.5778 1419.9913 1470.4272 1548.4616 1570.9474 1577.3493 1606.0828 3141.1382 3159.7494 3165.4971 3165.8050 3175.8271 3184.3065
redmass: 9.6707 14.7377 7.6591 11.5902 10.9211 13.0017 5.7402 30.9764 5.2996 7.9104 10.0580 7.6976 27.6669 5.2680 9.9253 4.9287 5.2707 5.0733 8.2537 4.5921 5.5028 6.3845 7.3690 6.9136 2.3704 8.2824 8.4438 1.4939 1.3417 7.0443 1.4523 1.3696 1.3392 1.3433 6.3514 7.4823 2.3582 1.9963 2.9779 1.4856 1.9155 1.0839 2.3410 1.3455 10.1990 6.9275 4.1159 2.6770 2.6777 2.9747 7.3587 6.5557 9.1802 6.9406 1.0870 1.0938 1.0890 1.0934 1.0988 1.0980
irintensity: 0.3026 0.2935 0.7257 0.6733 0.2669 0.8490 0.0047 0.0240 0.2646 1.7944 1.6719 0.1527 0.0023 0.5568 10.9516 2.1194 6.9139 0.3068 27.9906 2.1163 4.1526 5.9395 2.7221 27.1049 43.7614 8.3470 57.9275 25.8154 42.0754 13.8803 4.8923 1.3716 0.0018 0.1282 4.5156 63.1888 23.1644 11.3341 1.7356 3.0111 46.1073 0.1299 5.0369 1.0390 11.4078 7.2093 45.2016 40.8983 86.6645 7.8069 10.5794 46.8002 0.6276 23.5786 4.8198 6.8872 0.1148 0.6776 7.5255 0.5590
temp: 298.150 k
press: 1.00000 atm
elementType: 17 17 17 17 6 6 6 6 6 6 6 6 6 6 6 6 1 1 1 1 1 1
symmnumber: 1
zpe: 365227.1 jmol-1
zpe.correction: 0.139108 hartree
zpe.thermalcorrener: 0.152690 hartree
zpe.thermalcorrenthalpy: 0.153634 hartree
zpe.thermalcorrgfe: 0.097201 hartree
zpe.sumelectzpe: -2300.005759 hartree
zpe.sumelectthermal: -2299.992177 hartree
zpe.sumelectthermalent: -2299.991232 hartree
zpe.sumelectthermalfe: -2300.047665 hartree
dipole: -1.2585 1.7154 1.3672
dipole: 2.5290
quadrupole: -115.8673 -121.8423 -114.4753
quadrupole: -8.1631 8.9488 -1.9310
quadrupole: 1.5277 -4.4474 2.9197 -8.1631 8.9488 -1.9310
hfenergy: -2300.1448664 hartree
pointgroup: C01 [X(C12H6Cl4)]
dipole: -0.5147975 -0.5969746 -0.6071433 debye
dipolederiv: -0.1544097 -0.1995904 0.0281678 -0.1735324 -0.5893739 0.0622436 0.0287178 0.0642168 -0.0210373 -0.3247211 0.3058946 0.0132438 0.2763445 -0.5853467 -0.0028181 0.0174899 -0.0037872 -0.0405861 -0.443893 0.3295991 0.020765 0.4063447 -0.4231182 -0.0161447 0.0239683 -0.0133624 -0.0269618 -0.4553892 -0.0612607 -0.3104513 -0.0737161 -0.0812277 -0.0656604 -0.4120601 -0.0723434 -0.5441281 0.2741636 0.1119693 -0.0235705 0.0394066 -0.3500395 0.018293 -0.0539584 0.0051083 -0.0282891 0.2639561 0.0228462 -0.0224065 0.0454859 -0.0111624 0.0026474 0.0286176 0.0115985 0.1280056 0.0317455 0.3236441 -0.0337872 0.3945753 0.7621486 -0.1093963 -0.0335258 -0.0909094 -0.0204526 0.3412489 -0.4889444 -0.0255936 -0.3954562 0.8391137 0.0010636 -0.0237844 0.001593 -0.0607809 -0.341467 -0.0377618 -0.1662882 -0.0395579 -0.0634684 -0.0249357 -0.0676762 -0.0163011 -0.1411611 -0.2103695 -0.000503 0.1003306 -0.0126961 -0.0988062 0.0155987 -0.0056392 0.0071521 -0.0057355 0.4926189 -0.5441213 -0.0225147 -0.7228863 0.444478 0.046622 -0.0179197 0.0326182 -0.0518713 -0.1319754 0.1271982 -0.0042985 0.0751233 -0.1523983 -0.0102516 -0.0008608 -0.0131119 -0.0993024 -0.0964729 0.0706915 -0.0088004 0.1370171 -0.0667709 -0.0157342 -0.0096446 -0.0100777 -0.0890822 0.6046818 0.1069869 0.524493 0.1177833 -0.0255349 0.1120561 0.6164643 0.1149892 0.7887064 0.075922 0.0252791 -0.0269811 0.0247898 -0.1224401 0.0083024 -0.0303017 0.0059958 0.109031 -0.0864377 0.0042906 -0.1106452 -0.0018571 -0.118399 -0.0220436 -0.1424801 -0.0243519 -0.2575438 0.1007727 -0.0052057 0.0494742 -0.0002664 0.1352764 0.0002435 0.0647603 0.000752 0.0070367 0.038773 -0.0195824 -0.093084 -0.0161032 0.1298196 -0.0185724 -0.094395 -0.0167076 0.005167 0.0617186 -0.0223623 0.0127361 -0.0364073 -0.0102777 0.0156288 0.0154944 0.0144296 0.1624678 -0.0199372 -0.0084056 0.0229437 -0.0012037 0.0778422 0.006002 0.0227459 0.0069577 0.1617414 0.0261387 -0.0127627 0.0581525 -0.0143884 0.1489988 -0.002738 0.0688108 -0.0022679 -0.0776123 -0.046667 -0.0278991 0.0181146 -0.0287993 0.1606865 -0.0004062 0.0051766 -0.0021907 0.1023887 unknown
polarizability: 217.6797932|-6.0278145|154.5467854|2.3555436|-0.004134|118.461631 unknown
InChI: InChI=1S/C12H6Cl4/c13-8-3-1-2-7(6-8)11-9(14)4-5-10(15)12(11)16/h1-6H
charge 0 multiplicity 1
22 atoms
Cl -0.886734 2.508556 -0.233635
Cl -0.13514 -3.018042 0.037193
Cl -4.079492 2.047216 0.18972
Cl 4.122764 0.509133 2.10322
C  -0.650036 -0.266773 -0.080226
C  0.825177 -0.065988 -0.276636
C  -1.549034 0.83493 -0.041567
C  -1.21668 -1.55771 0.07555
C  1.665232 0.104665 0.851494
C  1.381219 -0.049598 -1.579814
C  -2.937201 0.644078 0.142837
C  -2.597226 -1.765976 0.26142
C  -3.462423 -0.654453 0.294884
C  3.045254 0.289023 0.649297
C  2.770226 0.137447 -1.752998
C  3.619842 0.309402 -0.636329
H  1.249533 0.095424 1.86324
H  0.729672 -0.180964 -2.449653
H  -2.991217 -2.778681 0.378489
H  -4.537862 -0.791323 0.438015
H  3.199824 0.150531 -2.760222
H  4.696703 0.455102 -0.761878
