program: Gaussian 09
title: 000091674
version: EM64L-G09RevD.01
frameworkgroup: C1[X(C12H6Cl4)]
method: RPBEPBE
basis: SDD
operation: Freq
keyword: #pfreq=noraman
keyword: PBEPBE/SDD
title: #p freq=noraman PBEPBE/SDD
converged: NO YES NO NO
title: Mulliken charges:
elementType: Cl Cl Cl Cl C C C C C C C C C C C C H H H H H H
charge: -0.013907 -0.013913 -0.025314 -0.057942 0.471571 0.316374 -0.271679 -0.271685 -0.324129 -0.356189 -0.227051 -0.227054 -0.089218 -0.072243 -0.193477 -0.234250 0.270026 0.248500 0.287708 0.287712 0.236267 0.259895
chargesum: 0.00000
title: Mulliken charges with hydrogens summed into heavy atoms:
elementType: Cl Cl Cl Cl C C C C C C C C C C C C
charge: -0.013907 -0.013913 -0.025314 -0.057942 0.471571 0.316374 -0.271679 -0.271685 -0.054103 -0.107689 0.060657 0.060657 -0.089218 -0.072243 0.042789 0.025645
polarizability: 2.36552141e+02 8.67216575e-04 1.40174989e+02 -5.86033819e+00 1.35070013e-02 1.19125364e+02
1716.lowfreq: -9.1579 0.0012 0.0025 0.0036 4.6668 6.3931 8.9516 35.4756 56.0594
frequency: -8.2956 35.4606 56.0477 102.5076 145.9338 168.9773 172.7690 176.7072 194.9130 235.8115 236.3226 280.4862 346.6091 381.9768 410.6831 423.4894 423.9801 464.5069 478.5821 514.8591 564.6192 597.6244 649.1836 696.9671 713.5933 739.8016 751.9432 791.3304 802.5644 859.2265 867.1825 892.5469 909.9823 980.0852 982.5034 1002.1367 1071.7765 1082.1741 1096.4468 1113.7919 1175.4985 1178.7814 1259.1991 1287.7777 1334.0191 1363.8337 1364.9209 1404.4971 1426.0779 1473.1799 1545.6373 1570.7289 1580.1600 1606.3170 3140.8793 3159.5745 3166.2681 3176.0143 3186.7807 3188.3878
redmass: 9.7420 19.7912 7.7164 15.8991 12.2172 12.8453 12.3232 7.3135 4.7930 11.5990 5.1103 7.5371 32.9430 10.8387 8.3223 3.5765 7.7864 5.0141 8.4085 5.1000 3.8441 5.4763 7.0673 2.2504 7.7168 7.7147 10.4275 1.4601 8.0307 1.4373 1.3651 1.4343 1.3663 1.3417 6.5559 5.9663 2.4035 1.6643 1.6121 5.1568 1.5923 1.0846 2.1828 1.4491 4.7747 4.5225 8.0339 2.7630 2.7508 3.1065 9.7603 6.5403 8.6919 6.9484 1.0870 1.0939 1.0933 1.0986 1.0933 1.0941
irintensity: 0.3083 0.0768 0.5090 0.1124 0.0709 0.7153 0.2692 0.1963 0.0025 0.0860 0.0009 1.9808 0.0152 5.4872 5.7869 1.2918 3.3002 6.2559 20.9175 0.0003 10.2131 0.2643 13.0276 27.5817 18.8236 1.4451 89.6695 29.8884 93.9844 41.2924 0.0044 5.8224 1.2011 0.1172 5.9514 5.6481 21.7255 6.6612 1.1886 16.7624 14.5010 0.1129 12.2891 0.0268 36.2658 23.7717 0.5996 20.1685 116.2272 7.7098 92.5233 45.4190 74.8701 40.8450 4.9227 7.1637 0.7380 7.3112 3.0634 0.8184
temp: 298.150 k
press: 1.00000 atm
elementType: 17 17 17 17 6 6 6 6 6 6 6 6 6 6 6 6 1 1 1 1 1 1
symmnumber: 1
zpe: 364888.8 jmol-1
zpe.correction: 0.138979 hartree
zpe.thermalcorrener: 0.152612 hartree
zpe.thermalcorrenthalpy: 0.153556 hartree
zpe.thermalcorrgfe: 0.096919 hartree
zpe.sumelectzpe: -2300.009276 hartree
zpe.sumelectthermal: -2299.995643 hartree
zpe.sumelectthermalent: -2299.994699 hartree
zpe.sumelectthermalfe: -2300.051336 hartree
dipole: 0.6464 0.0008 1.7066
dipole: 1.8249
quadrupole: -120.7961 -121.7583 -115.3532
quadrupole: -0.0030 -7.5485 0.0046
quadrupole: -1.4936 -2.4558 3.9493 -0.0030 -7.5485 0.0046
hfenergy: -2300.1482548 hartree
pointgroup: C01 [X(C12H6Cl4)]
dipole: 0.2136217 -0.0023734 -0.6854378 debye
dipolederiv: -0.2689166 0.2329306 -0.0237011 0.2435092 -0.6263146 0.0330285 -0.0265516 0.0294014 -0.0413296 -0.2687458 -0.2329423 -0.0221288 -0.2435532 -0.6268899 -0.0291753 -0.0249338 -0.0256219 -0.0409443 -0.897266 -0.0003947 -0.0826697 -0.0004441 -0.1275536 0.0001974 -0.094818 0.0001768 -0.0581195 -0.4584538 0.0010668 0.3141841 0.0014554 -0.0697355 -0.0016865 0.4221875 -0.0016704 -0.5578551 0.229444 0.0001442 0.0109337 0.0002688 -0.5071462 0.0014939 0.0454318 0.0015118 -0.049991 0.2976575 0.0001271 0.0219054 -0.0000392 -0.0101941 0.0005222 -0.0321575 0.0005142 0.134268 0.4061103 -0.3321455 0.0533156 -0.2395146 0.9756242 -0.0435536 0.0501418 -0.03969 -0.0363677 0.4059296 0.3322981 0.0509916 0.2396296 0.9763609 0.0368479 0.0484148 0.0330453 -0.0368951 -0.3518752 0.0005501 0.1699054 0.00019 -0.0574711 -0.0003195 0.0742205 -0.0003228 -0.1472379 -0.2211451 -0.0003582 -0.0988427 0.0000207 -0.0990353 0.0003304 0.0073401 0.0003256 -0.0043614 -0.5432031 0.1651602 -0.0461777 0.1095876 -0.2757735 0.0157015 -0.052474 0.0193647 -0.0797743 -0.5431218 -0.1655424 -0.0450846 -0.1100109 -0.2760961 -0.0143906 -0.051653 -0.0181378 -0.0795449 1.3622489 0.0006329 0.1432208 0.0006932 0.327265 -0.0011115 0.1583564 -0.001085 -0.0346364 0.6049443 -0.0018054 -0.5305085 -0.0021469 -0.0466949 0.0029806 -0.629386 0.0029663 0.8118338 0.0786677 0.0001047 0.0249914 0.0001117 -0.1273094 0.0008397 0.0289267 0.0008408 0.1087428 -0.0835977 0.0003806 0.1093617 0.0004915 -0.1177134 -0.0005088 0.1421453 -0.0005036 -0.263284 0.1005128 -0.0001775 -0.0505418 -0.0002368 0.1374688 -0.0004566 -0.0683781 -0.0004536 0.0082834 0.0405081 0.0003254 0.0950985 0.0003312 0.1345907 -0.0004657 0.0978168 -0.000453 0.0011708 0.0698905 -0.0291147 -0.0098734 -0.0294556 0.050144 -0.0030302 -0.0111664 -0.0028758 0.1695502 0.0698697 0.0290514 -0.0100481 0.0293898 0.05021 0.0037843 -0.0113481 0.0036925 0.1695097 0.0213273 -0.0002212 -0.0592361 -0.0002622 0.1510402 -0.0008048 -0.0703953 -0.0008051 -0.075702 -0.0507856 -0.0000702 -0.0150957 -0.000015 0.1652236 -0.0002234 -0.0017197 -0.0002204 0.1026847 unknown
polarizability: 236.8316217|0.0029937|140.1748728|-1.2028716|-0.0516586|118.8459991 unknown
InChI: InChI=1S/C12H6Cl4/c13-8-3-1-2-7(4-8)12-10(15)5-9(14)6-11(12)16/h1-6H
charge 0 multiplicity 1
22 atoms
Cl 0.468933 2.797566 -0.132384
Cl 0.469952 -2.798552 -0.114011
Cl 5.21296 0.00208 0.407359
Cl -4.215555 0.007104 2.165411
C  0.577841 -0.000425 -0.112402
C  -0.914037 -0.001206 -0.279903
C  1.331124 1.20059 -0.031426
C  1.33156 -1.200628 -0.023642
C  -1.748852 0.002712 0.865195
C  -1.492271 -0.005801 -1.5738
C  2.731238 1.231805 0.125493
C  2.731737 -1.230338 0.132982
C  3.408417 0.001102 0.205007
C  -3.144663 0.00199 0.68884
C  -2.896807 -0.006468 -1.720982
C  -3.740949 -0.002548 -0.587014
H  -1.317158 0.006234 1.870269
H  -0.845333 -0.008838 -2.456993
H  3.268201 2.18113 0.183377
H  3.269061 -2.179078 0.196762
H  -3.342993 -0.010036 -2.72107
H  -4.829807 -0.002995 -0.691768
