program: Gaussian 09
title: 000091695
version: EM64L-G09RevD.01
frameworkgroup: C1[X(C20H33NO)]
method: RPBEPBE
basis: SDD
operation: Freq
keyword: #p
keyword: freq=noraman
keyword: PBEPBE/SDD
title: #p freq=noraman PBEPBE/SDD
converged: NO YES NO NO
title: Mulliken charges:
elementType: O N C C C C C C C C C C C C C C C C C C C C H H H H H H H H H H H H H H H H H H H H H H H H H H H H H H H H H
charge: -0.274381 -0.104018 -0.351345 -0.050942 -0.359765 -0.358223 0.009105 -0.064728 -0.588972 -0.728446 -0.724938 -0.717889 0.517578 0.140322 0.482908 -0.473456 -0.431880 -0.406584 -0.425905 -0.699378 -0.700322 -0.749257 0.216267 0.184943 0.214691 0.182164 0.202969 0.202511 0.195757 0.196853 0.208473 0.209958 0.199787 0.243909 0.208297 0.200070 0.235250 0.199087 0.222187 0.231764 0.210444 0.235499 0.229461 0.227090 0.223000 0.244142 0.222105 0.215898 0.206632 0.222914 0.206410 0.214257 0.216483 0.215483 0.215762
chargesum: 0.00000
title: Mulliken charges with hydrogens summed into heavy atoms:
elementType: O N C C C C C C C C C C C C C C C C C C C C
charge: -0.274381 -0.104018 0.049865 0.163749 0.025368 0.040045 0.205958 0.143744 -0.179226 -0.076170 -0.068414 -0.040181 0.517578 0.140322 0.482908 -0.243995 -0.204790 -0.183585 -0.181763 -0.054743 -0.056741 -0.101529
polarizability: 2.63813561e+02 3.08760344e+01 2.10203824e+02 1.07658878e+00 -4.29076419e+00 2.02085673e+02
1716.lowfreq: -16.8296 -4.0873 -0.0006 -0.0003 0.0006 2.9012 6.1602 12.7103 20.3877
frequency: -13.2330 12.0416 20.3236 46.0246 54.9765 68.4118 85.0452 101.6273 137.9447 155.2489 177.4436 191.4063 193.3431 201.6030 213.8761 218.8065 226.5125 248.4172 261.4066 266.4874 301.4677 306.6069 309.1769 320.9334 353.1972 354.8841 358.0989 364.0806 385.0041 406.0135 408.3091 419.4414 449.5218 456.9719 472.8017 486.8439 518.4678 525.5505 570.9140 638.9499 666.6358 674.1521 743.7965 754.1976 799.6129 818.2614 823.7986 838.0064 843.9764 848.7360 855.1717 891.5069 900.9375 905.9327 916.4877 918.0745 931.3281 937.2583 941.4153 951.3782 952.9929 958.4231 971.7351 1010.6667 1016.3143 1020.9984 1022.6497 1060.2346 1065.1818 1089.6459 1104.0405 1109.9943 1118.4420 1125.7412 1132.2805 1136.0371 1149.5665 1150.6192 1159.2723 1198.0920 1203.4971 1208.6854 1216.9193 1222.3418 1227.8795 1264.3786 1272.7603 1278.7630 1284.4583 1301.2459 1304.8810 1313.2842 1322.4296 1335.1257 1336.8006 1340.0698 1347.3029 1365.3601 1370.9034 1372.6127 1372.7957 1375.3812 1375.9790 1387.7134 1390.3641 1403.3096 1406.8306 1447.3990 1453.5370 1459.2530 1460.4315 1462.3642 1463.3121 1464.7507 1467.1249 1470.1825 1476.6332 1478.9641 1479.2982 1482.7495 1487.1576 1487.4255 1495.2261 1507.7501 1575.5057 1622.3628 2847.0006 2856.8761 2882.1024 2960.3367 2965.8065 2967.8817 2971.2613 2972.2213 2973.1112 2977.4237 2986.6390 2988.1791 3000.4246 3024.8019 3025.6007 3029.6573 3037.0523 3058.5974 3065.9846 3067.4932 3069.6584 3075.7326 3078.0547 3080.1765 3080.9190 3084.1625 3085.3858 3096.9055 3101.5830 3107.1593 3109.5234 3134.1265 3155.5287
redmass: 3.0383 3.5934 3.9416 3.4536 3.5701 3.4731 3.0856 3.6604 2.7246 2.2893 2.6656 2.2438 1.1130 1.7469 1.1279 1.2098 1.4519 2.0578 1.3052 2.1890 2.3667 1.8558 1.3769 2.8382 2.3502 2.5080 2.7389 2.5957 2.3961 2.8429 2.5190 2.4891 2.8303 2.8576 3.3118 2.6310 2.9032 3.4084 2.4933 6.8699 3.7921 2.7176 3.5586 3.4765 2.7765 3.3809 2.2943 2.6890 2.1865 1.2878 1.8998 1.8369 1.4786 1.6643 1.7528 1.7810 1.6504 1.8126 1.2198 1.7682 1.8845 1.3653 1.3780 2.6789 2.0463 1.5190 1.3896 2.0792 1.7921 2.0129 2.1066 2.4738 2.1708 1.7750 1.8419 2.3702 1.6290 2.4379 2.0724 1.1688 2.9651 1.5625 2.6193 2.2072 1.3638 1.2582 3.0792 1.3135 1.3222 1.4928 1.3271 1.4400 1.4645 1.1947 1.3360 1.4224 1.3212 1.4650 3.4397 1.2648 1.3121 1.2375 1.2201 1.2718 1.3544 1.2145 2.8157 1.0754 1.0811 1.0508 1.0554 1.0651 1.0611 1.0490 1.0649 1.0809 1.0810 1.0710 1.0529 1.0573 1.0549 1.0509 1.1052 2.2112 6.4514 6.3835 1.0704 1.0690 1.0671 1.0833 1.0552 1.0508 1.0347 1.0349 1.0711 1.0358 1.0366 1.0360 1.0920 1.0994 1.0907 1.0867 1.0888 1.0984 1.0999 1.0998 1.1005 1.0984 1.0995 1.0978 1.0991 1.0988 1.0992 1.0998 1.1005 1.0873 1.0885 1.0952 1.0932
irintensity: 0.0364 0.0381 0.0168 0.1062 0.0991 0.3507 0.3683 0.6573 1.9952 2.2182 1.0350 0.5975 0.1916 0.1839 0.5557 0.2621 0.2780 0.3603 0.3063 0.7864 0.1467 0.6472 0.1296 0.4373 0.8748 4.6740 1.5308 2.1789 1.3865 0.0174 1.0690 1.7960 1.2325 0.3072 3.0937 5.6930 3.4717 1.7326 25.1363 0.0107 3.0487 1.0135 0.4051 9.5021 17.6356 13.6900 6.9573 6.8899 7.7373 1.4044 24.5958 1.4094 1.9924 5.3615 3.1434 0.3940 2.3417 5.8944 0.1979 6.7449 9.0245 0.5143 0.1051 8.5279 51.2993 10.7391 0.2024 43.2365 16.1736 27.3246 9.1028 17.9839 11.2136 33.7535 8.8837 12.0669 12.5282 20.6937 22.9673 2.2391 6.8482 4.1598 1.6822 0.8161 22.6697 2.7839 34.8258 2.7149 6.7401 0.2870 3.0062 4.6950 3.6212 7.6795 1.1848 6.0009 12.0165 4.4206 5.1065 23.8493 19.6680 6.7709 19.9898 36.6753 19.0292 10.8924 7.6934 1.7651 7.6634 0.0632 11.2885 1.9353 5.6847 0.7531 0.9690 8.5820 17.4334 14.3121 5.4019 16.0855 4.4311 11.4643 8.5605 50.1724 0.3663 0.4468 41.7209 74.5181 119.5093 41.4533 2.3395 35.0807 32.7712 31.5709 46.3654 32.1507 28.1725 23.2227 38.0905 19.1187 21.5710 68.0070 16.5562 51.7772 5.3991 6.9344 15.7491 133.1199 35.9544 33.2893 47.3564 29.7597 33.4203 32.5936 31.1992 8.2571 29.7550 28.2770 11.3197
temp: 298.150 k
press: 1.00000 atm
elementType: 8 7 6 6 6 6 6 6 6 6 6 6 6 6 6 6 6 6 6 6 6 6 1 1 1 1 1 1 1 1 1 1 1 1 1 1 1 1 1 1 1 1 1 1 1 1 1 1 1 1 1 1 1 1 1
symmnumber: 1
zpe: 1277388.3 jmol-1
zpe.correction: 0.486531 hartree
zpe.thermalcorrener: 0.510084 hartree
zpe.thermalcorrenthalpy: 0.511029 hartree
zpe.thermalcorrgfe: 0.433235 hartree
zpe.sumelectzpe: -910.152213 hartree
zpe.sumelectthermal: -910.128660 hartree
zpe.sumelectthermalent: -910.127716 hartree
zpe.sumelectthermalfe: -910.205509 hartree
dipole: -1.3023 0.9067 -0.0471
dipole: 1.5875
quadrupole: -140.8580 -141.5845 -129.3821
quadrupole: 11.1683 -0.6198 -3.7554
quadrupole: -3.5831 -4.3096 7.8927 11.1683 -0.6198 -3.7554
hfenergy: -910.6387445 hartree
pointgroup: C01 [X(C20H33N1O1)]
dipole: 0.5193868 0.3371598 0.0816272 debye
polarizability: 262.4211394|-32.0121029|210.1641765|-2.7906687|4.9612628|203.5177421 unknown
InChI: InChI=1S/C20H33NO/c1-15(12-21-13-16(2)22-17(3)14-21)11-18-7-9-19(10-8-18)20(4,5)6/h7-10,15-17H,11-14H2,1-6H3
charge 0 multiplicity 1
55 atoms
O  -4.599405 -1.927726 -0.027624
N  -2.771127 0.286986 0.297309
C  -1.570903 1.04877 0.728296
C  -1.064888 2.052404 -0.338106
C  -2.450926 -0.836393 -0.61938
C  -3.576498 -0.214599 1.438245
C  -3.745373 -1.481816 -1.154033
C  -4.897641 -0.839354 0.936594
C  0.301868 2.671988 0.094649
C  -2.112001 3.158018 -0.593948
C  -3.484453 -2.729125 -1.999535
C  -5.876685 0.198348 0.35411
C  1.467376 1.692159 0.089845
C  4.829094 -1.205202 0.070221
C  3.660142 -0.190842 0.049946
C  2.029237 1.19054 1.29185
C  2.028679 1.239245 -1.129768
C  3.098498 0.271071 1.271487
C  3.099936 0.317995 -1.150143
C  4.359261 -2.51514 0.772965
C  6.029585 -0.601602 0.860099
C  5.320176 -1.567685 -1.354816
H  -0.738131 0.362604 1.019466
H  -1.846703 1.625677 1.63453
H  -0.895422 1.503426 -1.287647
H  -1.84216 -1.622818 -0.10125
H  -1.857361 -0.456948 -1.471262
H  -3.804791 0.63012 2.114979
H  -3.01984 -0.988767 2.025727
H  -4.295555 -0.72093 -1.748185
H  -5.380739 -1.376205 1.773867
H  0.521481 3.511951 -0.594355
H  0.18349 3.115552 1.10406
H  -3.096336 2.705207 -0.805777
H  -1.822664 3.798432 -1.448175
H  -2.218767 3.809739 0.295646
H  -4.440251 -3.164187 -2.338017
H  -2.876276 -2.480836 -2.888734
H  -2.950575 -3.492466 -1.405885
H  -6.721176 -0.314723 -0.138296
H  -6.282758 0.834312 1.162947
H  -5.372824 0.855378 -0.374937
H  1.625145 1.528338 2.254795
H  1.628236 1.618612 -2.079239
H  3.501203 -0.08905 2.22593
H  3.501503 0.002218 -2.117958
H  3.514948 -2.973028 0.225713
H  4.026598 -2.323594 1.808784
H  5.187272 -3.248235 0.810799
H  6.390289 0.325923 0.378893
H  6.86685 -1.324177 0.893926
H  5.752285 -0.356015 1.900882
H  5.692874 -0.679042 -1.897092
H  4.5191 -2.033681 -1.958195
H  6.152004 -2.292628 -1.286501
