program: Gaussian 09
title: 000009636
version: EM64L-G09RevD.01
frameworkgroup: C1[X(C2F5I)]
method: RPBEPBE
basis: SDD
operation: Freq
keyword: #p
keyword: freq=noraman
keyword: PBEPBE/SDD
title: #p freq=noraman PBEPBE/SDD
converged: YES YES NO NO
title: Mulliken charges:
elementType: I F F F F F C C
charge: 0.213730 -0.124215 -0.124273 -0.134212 -0.131604 -0.131798 -0.039363 0.471735
chargesum: 0.00000
title: Mulliken charges with hydrogens summed into heavy atoms:
polarizability: 6.39615436e+01 -1.33538624e+01 3.44951106e+01 4.39880037e-03 -1.35407500e-03 2.94561922e+01
1716.lowfreq: -16.5903 -3.8686 -2.8204 -0.0007 0.0003 0.0005 53.7780 122.6358 196.4390
frequency: 53.5364 122.6357 196.4372 238.9098 242.4243 273.8237 320.5494 376.5386 463.7375 517.1121 545.2696 648.1368 832.6183 982.5059 1010.6736 1060.2829 1071.7917 1180.2839
redmass: 19.8045 22.9173 18.4754 24.2313 19.3400 19.7018 18.7645 18.0896 17.9084 17.9012 17.1826 17.0497 13.4889 13.6111 13.1399 13.1478 13.2322 12.4317
irintensity: 0.0986 0.8639 3.6620 1.6282 0.0088 1.5452 0.0872 1.4769 9.9176 1.1904 13.2089 44.0136 246.2896 141.6672 76.6408 210.7051 321.4456 119.8006
temp: 298.150 k
press: 1.00000 atm
elementType: 53 9 9 9 9 9 6 6
symmnumber: 1
zpe: 60634.3 jmol-1
zpe.correction: 0.023094 hartree
zpe.thermalcorrener: 0.031206 hartree
zpe.thermalcorrenthalpy: 0.032150 hartree
zpe.thermalcorrgfe: -0.011967 hartree
zpe.sumelectzpe: -586.277056 hartree
zpe.sumelectthermal: -586.268944 hartree
zpe.sumelectthermalent: -586.268000 hartree
zpe.sumelectthermalfe: -586.312117 hartree
dipole: 1.6560 -0.5251 -0.0020
dipole: 1.7373
quadrupole: -55.7720 -59.7921 -59.8905
quadrupole: -1.2440 0.0023 0.0014
quadrupole: 2.7129 -1.3072 -1.4057 -1.2440 0.0023 0.0014
hfenergy: -586.3001503 hartree
pointgroup: C01 [X(C2F5I1)]
dipole: -0.4829177 -0.4835763 -0.0102548 debye
dipolederiv: -0.1630102 -0.2620732 -0.0058785 -0.2258988 -0.2620742 -0.0072218 -0.0049606 -0.0072434 0.0525088 -0.321678 -0.0104335 -0.0522225 -0.094969 -0.6322746 0.3220136 0.0903045 0.3635436 -0.6076889 -0.321861 -0.0125951 0.0521673 -0.090419 -0.6011696 -0.3218249 -0.0940048 -0.3630367 -0.6388068 -0.671741 -0.3866173 -0.0109548 -0.2010428 -0.6205929 -0.0103867 -0.0068936 -0.0110315 -0.2692258 -0.4041514 0.0522903 -0.1229281 0.0860291 -0.3966925 0.2519387 -0.0821208 0.1960668 -0.612197 -0.4046538 0.0458314 0.1268994 0.0822897 -0.371853 -0.2381923 0.0873447 -0.182383 -0.6368017 0.769311 0.2455239 0.0051993 0.6585185 1.6528695 0.0102534 0.0146115 0.010304 1.2052945 1.5177844 0.3280734 0.0077179 -0.2145076 1.2317874 -0.0065801 -0.0042809 -0.0062196 1.506917 unknown
polarizability: 46.772144|19.7270338|51.6728459|0.4523585|0.5090662|29.4678566 unknown
InChI: InChI=1S/C2F5I/c3-1(4,5)2(6,7)8
charge 0 multiplicity 1
8 atoms
I  -2.11604 -1.386288 -0.031874
F  -0.903073 1.122576 -1.113354
F  -0.904127 1.071418 1.162103
F  1.651892 0.94293 0.030372
F  1.082833 -0.968162 1.110985
F  1.087083 -0.902634 -1.161192
C  -0.697549 0.28927 0.006311
C  0.799181 -0.169209 -0.003352
