program: Gaussian 09
title: 000091742
version: EM64L-G09RevD.01
frameworkgroup: C1[X(C14H21NO4)]
method: RPBEPBE
basis: SDD
operation: Freq
keyword: #p
keyword: freq=noraman
keyword: PBEPBE/SDD
title: #p freq=noraman PBEPBE/SDD
converged: YES YES NO NO
title: Mulliken charges:
elementType: O O O O N C C C C C C C C C C C C C C H H H H H H H H H H H H H H H H H H H H H
charge: -0.326156 -0.242582 -0.236799 -0.290402 -0.464019 0.524500 0.217569 0.049438 0.197853 -0.508066 -0.511933 -0.308795 -0.681075 -0.685602 0.255856 -0.240973 -0.242805 -0.687586 -0.684604 0.233191 0.323666 0.221619 0.246949 0.328220 0.210417 0.252776 0.217121 0.208298 0.232292 0.220660 0.213157 0.213344 0.203891 0.203556 0.204950 0.231422 0.231386 0.202320 0.233460 0.233486
chargesum: 0.00000
title: Mulliken charges with hydrogens summed into heavy atoms:
elementType: O O O O N C C C C C C C C C C C C C C
charge: -0.326156 -0.242582 -0.236799 -0.290402 -0.135799 0.524500 0.217569 0.282629 0.197853 -0.184400 -0.290314 -0.061846 -0.000761 -0.024351 0.255856 0.185528 0.164641 -0.019828 -0.015337
polarizability: 2.78024469e+02 -5.38050548e+00 1.89441512e+02 1.70934880e+00 -4.30323228e-01 1.07833347e+02
1716.lowfreq: -4.3184 -0.0008 -0.0007 -0.0003 4.8828 5.8070 26.0755 33.2571 56.2376
frequency: 26.0255 33.2167 56.2363 59.7718 65.3625 78.2823 94.1593 95.6908 113.5952 120.2274 141.0699 170.0162 184.9885 194.2930 226.2760 237.0251 243.3378 245.5865 249.8066 281.3309 313.7779 342.2717 365.5154 375.9080 382.2855 401.2482 449.5623 462.2508 523.3309 581.5725 593.4215 617.5303 641.1390 694.6351 707.9918 716.2514 739.7442 754.4270 785.2593 810.6567 825.6803 832.6460 876.4084 892.3939 896.5398 899.6233 903.1095 925.9315 941.4793 968.6539 1011.8505 1033.0505 1036.7506 1104.8283 1113.4234 1116.4298 1128.7032 1134.6830 1135.9697 1155.1300 1158.9726 1182.5250 1193.5118 1216.5201 1264.1282 1265.2408 1276.9166 1286.4674 1323.2175 1340.6525 1364.1676 1368.1303 1380.0420 1393.8381 1396.2746 1399.1151 1406.0983 1429.5134 1456.3464 1459.6621 1460.5486 1464.4120 1471.9239 1476.3463 1477.3383 1486.9487 1487.6164 1488.6062 1498.9286 1520.6879 1602.1507 1620.4456 1652.4562 2945.9347 2961.2529 2988.0141 2992.1629 2996.6945 2996.8742 3002.7589 3020.1402 3026.6876 3083.3585 3092.4976 3093.7218 3094.0323 3097.4181 3102.8446 3106.2092 3107.0596 3124.6002 3168.7793 3189.8634 3547.1747
redmass: 3.7751 3.1087 4.1391 4.1351 3.9602 4.2346 3.4841 3.4264 1.7768 1.8939 3.6961 5.2968 1.0923 3.3682 1.6547 1.6449 1.2649 1.7460 2.4665 4.1204 4.4996 2.8860 5.5331 5.4910 4.0548 3.0233 2.6609 3.2331 4.5793 6.1968 5.4797 3.4751 1.3220 5.1621 5.8259 5.5898 3.2627 4.3421 1.5180 3.8965 1.1134 1.1084 3.2129 1.4502 1.3877 2.8497 3.2275 1.2362 1.3530 6.4336 3.8543 2.6788 2.7147 1.8698 2.3251 2.1979 2.3989 1.4437 1.4391 2.2059 2.1540 1.9378 2.1710 2.1462 1.1406 1.1374 2.2925 1.6027 1.4499 1.2989 1.5488 1.2956 1.2638 1.7297 1.2335 1.2751 2.1685 5.1622 1.0534 1.0400 1.0398 1.0482 1.0508 1.1014 1.0711 1.0671 1.1512 1.0930 1.8057 2.6314 5.6333 6.5485 8.4783 1.0551 1.0556 1.0355 1.0358 1.0363 1.0362 1.1072 1.1074 1.0865 1.0993 1.0987 1.0988 1.0988 1.1006 1.1006 1.1013 1.1013 1.0899 1.0931 1.0914 1.0760
irintensity: 0.2560 0.7474 0.0021 0.8261 9.5843 0.3150 5.4160 2.2476 1.3975 0.0182 1.6519 0.2770 0.0944 2.7127 2.0179 1.1760 0.2488 4.1995 0.5625 9.5991 0.8217 0.2681 4.2996 1.6653 5.4938 8.6029 2.3425 3.3920 2.7827 5.5184 5.5893 18.5760 33.8401 35.0509 23.0166 5.4705 0.4064 15.3860 74.2698 8.7069 14.5708 0.0033 9.3907 33.4052 0.2982 19.7425 40.6962 2.7918 1.1336 222.7188 98.8521 82.4898 38.9448 284.6649 14.1089 8.7613 264.7956 4.6555 4.7612 147.5447 186.0553 42.6845 106.4142 234.7442 0.0393 0.0688 81.9559 62.7625 4.8381 10.2619 25.9892 21.5526 34.1151 27.5575 28.3337 18.5291 70.3507 108.2157 5.4682 7.6713 15.3579 5.4750 3.8611 30.8824 30.4701 10.1379 44.6743 16.8349 71.6206 610.4220 90.3213 45.0625 249.2653 51.7529 31.5165 16.9543 29.6889 21.2932 34.1807 41.1959 30.7739 6.6929 5.7883 59.4924 53.9087 6.5103 19.7943 34.7449 29.0389 40.0528 19.6629 13.9871 12.4885 28.8994
temp: 298.150 k
press: 1.00000 atm
elementType: 8 8 8 8 7 6 6 6 6 6 6 6 6 6 6 6 6 6 6 1 1 1 1 1 1 1 1 1 1 1 1 1 1 1 1 1 1 1 1 1
symmnumber: 1
zpe: 867987.6 jmol-1
zpe.correction: 0.330599 hartree
zpe.thermalcorrener: 0.351867 hartree
zpe.thermalcorrenthalpy: 0.352811 hartree
zpe.thermalcorrgfe: 0.279159 hartree
zpe.sumelectzpe: -900.270702 hartree
zpe.sumelectthermal: -900.249434 hartree
zpe.sumelectthermalent: -900.248490 hartree
zpe.sumelectthermalfe: -900.322141 hartree
dipole: -1.1010 -2.0760 0.1389
dipole: 2.3540
quadrupole: -94.2320 -100.1409 -116.0533
quadrupole: -5.4214 0.1355 -0.4212
quadrupole: 9.2434 3.3345 -12.5779 -5.4214 0.1355 -0.4212
hfenergy: -900.6013006 hartree
pointgroup: C01 [X(C14H21N1O4)]
dipole: 0.4631331 -0.7940506 -0.1127253 debye
polarizability: 277.5077401|8.7086403|189.5585174|0.432988|5.8483251|108.2330707 unknown
InChI: InChI=1S/C14H21NO4/c1-5-17-12-8-7-11(9-13(12)18-6-2)15-14(16)19-10(3)4/h7-10,15H,5-6H2,1-4H3
charge 0 multiplicity 1
40 atoms
O  3.919959 -0.533178 -0.257264
O  -2.505504 1.675351 -0.107996
O  -3.950147 -0.5420 -0.338079
O  2.435411 1.299855 -0.111759
N  1.703679 -0.946153 -0.338518
C  0.282949 -0.830352 -0.337124
C  -1.779125 0.486793 -0.221259
C  5.087975 0.410868 -0.197705
C  -2.558364 -0.70919 -0.34523
C  -0.3702 0.424465 -0.21696
C  -0.478863 -2.012473 -0.460154
C  -1.890406 -1.946597 -0.46322
C  5.370263 0.949858 -1.607549
C  6.236887 -0.405543 0.398805
C  2.642323 0.06226 -0.228305
C  -1.738569 2.932954 0.01856
C  -4.775108 -1.758204 -0.454144
C  -2.763226 4.058846 0.122836
C  -6.231837 -1.303734 -0.414533
H  4.796414 1.242423 0.470851
H  0.239559 1.323763 -0.121619
H  0.018517 -2.985125 -0.553735
H  -2.460381 -2.874775 -0.558724
H  2.093259 -1.887238 -0.422795
H  6.241393 1.630339 -1.584701
H  4.502974 1.514993 -1.988381
H  5.594148 0.120774 -2.302336
H  7.134218 0.230581 0.505084
H  5.965089 -0.796143 1.394278
H  6.491063 -1.258914 -0.254652
H  -1.086714 3.058045 -0.869995
H  -1.095699 2.883661 0.921001
H  -4.544195 -2.445228 0.387029
H  -4.54129 -2.276994 -1.407677
H  -2.247772 5.03203 0.217642
H  -3.403912 4.085469 -0.774996
H  -3.41012 3.915558 1.004998
H  -6.905732 -2.175699 -0.501114
H  -6.449494 -0.78249 0.533044
H  -6.443623 -0.610557 -1.246204
