program: Gaussian 09
title: 000091648
version: EM64L-G09RevD.01
frameworkgroup: C1[X(C12HCl9)]
method: RPBEPBE
basis: SDD
operation: Freq
keyword: #pfreq=noraman
keyword: PBEPBE/SDD
title: #p freq=noraman PBEPBE/SDD
converged: NO NO NO NO
title: Mulliken charges:
elementType: Cl Cl Cl Cl Cl Cl Cl Cl Cl C C C C C C C C C C C C H
charge: 0.049781 0.049780 0.039865 0.004267 0.063863 0.063862 0.072698 0.056920 0.028268 0.590050 0.524233 -0.305611 -0.305621 -0.226870 -0.290992 -0.084427 -0.084441 -0.112149 -0.086416 -0.231624 -0.106221 0.290782
chargesum: 0.00000
title: Mulliken charges with hydrogens summed into heavy atoms:
elementType: Cl Cl Cl Cl Cl Cl Cl Cl Cl C C C C C C C C C C C C
charge: 0.049781 0.049780 0.039865 0.004267 0.063863 0.063862 0.072698 0.056920 0.028268 0.590050 0.524233 -0.305611 -0.305621 -0.226870 -0.290992 -0.084427 -0.084441 -0.112149 -0.086416 0.059158 -0.106221
polarizability: 3.09969456e+02 -2.14312940e-04 1.88789059e+02 1.30348058e+00 -2.71993476e-03 1.68081829e+02
1716.lowfreq: -0.0024 -0.0020 -0.0010 4.2813 4.9038 5.5810 20.2623 30.8921 30.9681
frequency: 20.2203 30.8920 30.9612 65.9391 69.5649 73.1836 88.2105 93.0487 127.1078 156.5343 183.2022 192.2523 201.9425 204.1181 204.2647 206.4867 216.3057 234.7435 277.0014 307.3867 312.0749 328.3454 329.0744 351.4682 355.7783 359.2425 365.8399 466.2125 519.2121 525.6211 555.0597 563.5917 603.2214 621.6241 639.1586 659.9405 666.8761 760.2709 763.8880 781.5408 787.9750 819.9685 863.1822 874.0896 1011.8340 1077.8611 1153.7386 1160.9287 1241.3814 1311.7477 1314.2938 1331.0185 1340.9550 1357.9003 1433.5655 1518.5477 1534.6179 1552.2364 1577.6619 3185.4589
redmass: 26.5711 28.5942 28.9406 34.0856 33.0014 31.3176 29.2341 31.2226 29.1889 9.6455 23.9687 15.6273 30.1120 32.5723 31.0249 30.6151 34.5123 25.6156 7.5616 28.2958 28.1419 30.2672 12.4477 30.6114 25.8460 14.2389 12.4596 11.8382 8.1339 5.1494 13.5630 10.1462 12.0779 13.7753 11.6233 10.2024 12.7090 8.5800 11.7299 11.9167 11.7118 12.8967 1.4277 10.8829 11.3682 8.1856 4.3586 2.3562 6.9039 10.9376 12.0497 12.0031 9.5316 5.2183 5.8909 12.0010 10.5296 11.1239 10.5266 1.0935
irintensity: 0.0246 0.0128 0.0094 0.0005 0.0022 0.0056 0.0260 0.0111 0.0204 0.2385 0.1779 0.1788 0.3747 0.0101 0.0546 0.0161 0.0002 0.0362 1.1065 0.1157 0.2655 0.0259 0.0095 0.0403 0.2609 0.4334 0.2119 25.7128 3.6245 1.8018 48.4248 3.9398 0.0034 32.2130 4.7772 35.0072 8.2475 2.3388 79.8121 22.0773 2.5126 0.4948 18.2796 4.8559 17.8459 10.6982 0.8611 38.7200 25.9493 122.9144 171.1519 11.0400 13.8276 154.8135 18.2228 0.0564 33.9826 33.8945 28.1577 3.1772
temp: 298.150 k
press: 1.00000 atm
elementType: 17 17 17 17 17 17 17 17 17 6 6 6 6 6 6 6 6 6 6 6 6 1
symmnumber: 1
zpe: 239016.1 jmol-1
zpe.correction: 0.091036 hartree
zpe.thermalcorrener: 0.112058 hartree
zpe.thermalcorrenthalpy: 0.113002 hartree
zpe.thermalcorrgfe: 0.037494 hartree
zpe.sumelectzpe: -4596.916054 hartree
zpe.sumelectthermal: -4596.895033 hartree
zpe.sumelectthermalent: -4596.894089 hartree
zpe.sumelectthermalfe: -4596.969597 hartree
dipole: 0.5153 -0.0004 1.0037
dipole: 1.1283
quadrupole: -181.8957 -182.4325 -179.1163
quadrupole: -0.0015 4.7067 -0.0010
quadrupole: -0.7476 -1.2843 2.0319 -0.0015 4.7067 -0.0010
hfenergy: -4597.0070909 hartree
pointgroup: C01 [X(C12H1Cl9)]
dipole: -0.213111 -0.0003563 -0.3893955 debye
dipolederiv: -0.2491244 0.2685968 -0.0172582 0.266135 -0.492756 0.020553 -0.0187683 0.0195776 0.0067177 -0.2490146 -0.2685823 -0.0168622 -0.2661226 -0.4929157 -0.0198291 -0.0183661 -0.0188388 0.0067785 -0.2149317 -0.0001988 -0.2341442 -0.0001948 0.0021139 -0.0004048 -0.2311706 -0.0004175 -0.5154921 -0.3180901 0.0001836 0.2706607 0.0001978 -0.0198589 -0.0004294 0.2720493 -0.0004054 -0.5595132 -0.2123247 0.2842604 -0.0123474 0.3321418 -0.4919006 0.0190969 -0.0171142 0.0206511 0.017382 -0.2121985 -0.284219 -0.0119366 -0.3321126 -0.4920883 -0.018372 -0.0166418 -0.019937 0.0174374 -0.7293656 -0.0000987 -0.0466518 -0.0000965 -0.000158 0.0000097 -0.0547237 0.000005 0.016935 -0.2812497 0.0002061 0.2936631 0.0002621 0.0153334 -0.0003079 0.3763703 -0.0003125 -0.4197579 -0.8103695 -0.0001646 -0.0883799 -0.000185 -0.0103353 -0.0000633 -0.1110552 -0.0000622 -0.0703534 0.2137519 0.0000569 -0.0005486 0.0000717 -0.2831587 0.0002424 0.007181 0.0002568 0.0500608 0.1740532 0.0000634 0.0583879 0.0000245 0.0268297 -0.0003181 0.0102726 -0.0003252 -0.3815479 0.2328666 -0.4667036 0.023109 -0.4492175 0.6163127 -0.0371071 0.0219576 -0.0305691 -0.0227911 0.2326937 0.4666606 0.0224178 0.4491668 0.6165982 0.036171 0.0212728 0.0296054 -0.022887 0.2313005 0.0003186 0.3938189 0.0002865 -0.0032326 0.0005445 0.358526 0.000542 0.6877942 0.4270558 -0.0002913 -0.4283001 -0.0001653 -0.045159 0.0007317 -0.2697128 0.000713 0.8762071 -0.0212319 -0.5541434 -0.0024482 -0.6047546 0.6038365 -0.0370704 0.0000611 -0.0388581 -0.0236288 -0.0214544 0.55402 -0.0032552 0.604626 0.6041831 0.0361852 -0.0008103 0.0379964 -0.0237342 1.0197024 0.0001542 0.069599 0.0001675 -0.193374 0.0001254 0.0764775 0.0001259 -0.0200011 0.0067202 -0.0005051 -0.6356456 -0.0005314 -0.0402477 0.0003149 -0.6952326 0.0003322 0.441959 -0.4732293 0.0000463 0.1174427 0.0000237 -0.0473673 -0.0001512 0.0937663 -0.0001327 -0.2356529 1.1883656 0.0003604 0.2594705 0.0003027 -0.035488 0.0001694 0.2071472 0.0001459 0.122628 0.0660744 -0.0000206 -0.0107912 -0.000026 0.1628327 -0.000091 -0.0114863 -0.0000925 0.05146 unknown
polarizability: 309.9391112|0.0102968|188.7890575|-2.4502275|-0.007647|168.1121752 unknown
InChI: InChI=1S/C12HCl9/c13-2-1-3(14)6(15)7(16)4(2)5-8(17)10(19)12(21)11(20)9(5)18/h1H
charge 0 multiplicity 1
22 atoms
Cl 0.400405 2.767951 -0.094968
Cl 0.400938 -2.767952 -0.091002
Cl -0.940099 0.001902 2.578959
Cl -0.562775 -0.002428 -2.966455
Cl 3.614041 -2.782934 0.141849
Cl 3.613479 2.783904 0.13788
Cl 5.216881 0.00068 0.257961
Cl -4.162108 0.001499 2.349812
Cl -5.535874 -0.001094 -0.598307
C  0.584264 0.000026 -0.081613
C  -0.907918 -0.00018 -0.195155
C  1.310682 1.21373 -0.029491
C  1.310911 -1.213465 -0.027789
C  -1.732798 0.000628 0.958208
C  -1.555479 -0.001269 -1.453536
C  2.720064 -1.225668 0.075531
C  2.719833 1.226354 0.073779
C  3.425643 0.000443 0.126545
C  -3.144986 0.000424 0.867742
C  -2.954636 -0.001577 -1.58073
C  -3.742291 -0.000716 -0.414461
H  -3.427476 -0.002458 -2.565457
