program: Gaussian 09
title: 000091588
version: EM64L-G09RevD.01
frameworkgroup: C1[X(C10H13NO2)]
method: RPBEPBE
basis: SDD
operation: Freq
keyword: #p
keyword: freq=noraman
keyword: PBEPBE/SDD
title: #p freq=noraman PBEPBE/SDD
converged: YES YES NO NO
title: Mulliken charges:
elementType: O O N C C C C C C C C C C H H H H H H H H H H H H H
charge: -0.453229 -0.454006 -0.335031 -0.175789 0.345531 -0.495254 0.329101 -0.441057 -0.711093 -0.507753 -0.520586 0.106913 0.130672 0.195495 0.208060 0.235119 0.192700 0.215238 0.260960 0.241424 0.211580 0.203469 0.249626 0.256097 0.355525 0.356290
chargesum: 0.00000
title: Mulliken charges with hydrogens summed into heavy atoms:
elementType: O O N C C C C C C C C C C
charge: -0.097704 -0.097716 -0.074071 0.019705 0.345531 -0.052076 0.329101 -0.033119 -0.054621 -0.258128 -0.264488 0.106913 0.130672
polarizability: 1.59245650e+02 1.44082493e+00 1.28582560e+02 8.59564185e-01 -3.68051005e+00 7.18756949e+01
1716.lowfreq: -221.8450 -5.2385 -0.0006 -0.0004 0.0004 5.2327 9.6394 59.6934 93.6166
frequency: -221.8441 59.6583 93.6081 147.0579 212.1107 233.5741 245.9889 262.1639 268.0248 328.9701 374.7095 393.5572 403.5394 430.8956 477.2822 483.8763 491.6593 521.3675 577.8093 648.7027 653.0895 708.6148 709.6337 733.2508 780.1844 867.5099 877.2198 886.0593 911.5845 953.0569 1000.8667 1039.6712 1053.4923 1096.2843 1106.7849 1135.7938 1143.0119 1160.4441 1189.9399 1194.2242 1206.2912 1234.5940 1243.4039 1287.7524 1305.5343 1306.6817 1330.8785 1374.5316 1387.0671 1398.2398 1428.6134 1440.7897 1445.6448 1469.3150 1477.2876 1481.5378 1498.2650 1587.0415 1634.2704 2808.4077 2866.1272 2980.1167 2983.1791 3036.2245 3044.4508 3073.1278 3103.8880 3147.2025 3155.0228 3465.6395 3524.7906 3527.5535
redmass: 1.1410 3.3602 3.8609 3.5127 2.6068 1.5493 2.5239 5.1850 2.9903 3.1982 3.4809 5.2828 3.1371 3.2338 3.6631 2.1235 1.1256 3.2161 2.4657 4.1818 4.1390 2.3695 3.5905 3.5650 4.3428 1.4720 1.5276 1.6517 2.2552 2.5688 1.7246 2.3499 2.0119 2.2446 2.3954 1.3806 1.3964 2.5871 1.9397 1.5171 1.6691 1.5059 1.2220 1.3557 1.9449 1.7780 1.6923 1.4796 1.2248 3.9222 3.7786 1.2723 1.1609 1.1126 1.1070 1.0945 3.4422 7.8602 7.2921 1.0798 1.0713 1.0596 1.0373 1.0989 1.0918 1.0969 1.1007 1.0917 1.0911 1.0753 1.0658 1.0657
irintensity: 234.0764 0.1441 1.2342 4.5501 2.4961 0.6503 1.6659 16.5590 5.1803 1.0145 0.3336 1.9305 13.1539 11.9927 4.9918 61.6707 31.4727 8.2306 43.3987 27.8212 13.6597 21.9987 3.3314 3.2048 71.0672 2.1531 26.9326 12.0409 10.6869 8.2571 2.2331 15.3198 3.8216 27.0598 31.1513 166.8558 41.1773 28.2736 40.1138 15.6240 31.7700 5.3053 10.0217 27.1755 29.9029 14.1113 5.8983 24.6655 17.8287 18.3748 4.2374 15.9261 1.9192 0.3627 6.7730 7.0443 153.8192 4.7863 2.0226 81.3224 123.3460 33.5382 38.3504 35.1577 56.0930 40.4006 25.7902 8.0966 4.1510 1.3673 9.4568 48.7533
temp: 298.150 k
press: 1.00000 atm
elementType: 8 8 7 6 6 6 6 6 6 6 6 6 6 1 1 1 1 1 1 1 1 1 1 1 1 1
symmnumber: 1
zpe: 556914.0 jmol-1
zpe.correction: 0.212117 hartree
zpe.thermalcorrener: 0.223693 hartree
zpe.thermalcorrenthalpy: 0.224638 hartree
zpe.thermalcorrgfe: 0.175131 hartree
zpe.sumelectzpe: -593.068925 hartree
zpe.sumelectthermal: -593.057349 hartree
zpe.sumelectthermalent: -593.056405 hartree
zpe.sumelectthermalfe: -593.105912 hartree
dipole: -0.8057 0.0756 -0.8739
dipole: 1.1910
quadrupole: -63.7515 -78.1408 -78.7655
quadrupole: 1.4170 3.1581 -1.9677
quadrupole: 9.8011 -4.5882 -5.2129 1.4170 3.1581 -1.9677
hfenergy: -593.2810428 hartree
pointgroup: C01[X(C10H13N1O2)]
dipole: -0.3157706 -0.0271799 0.3451201 debye
dipolederiv: -1.055858 0.460526 0.0359317 0.534583 -0.5004714 0.223659 0.0942127 0.1209197 -0.3331615 -1.2917738 -0.2732741 0.0352716 -0.2987051 -0.2880625 0.2270633 -0.0488148 0.1420506 -0.3322677 -0.3501896 0.0891214 -0.0874002 0.0658473 -0.5947251 -0.0613212 -0.1891749 -0.0829737 -0.5933769 0.395761 -0.2029302 0.0240468 -0.1818846 0.3260136 -0.0951965 0.0323748 -0.0548762 0.4252958 0.095988 0.0952513 -0.0100892 0.2176349 -0.0534149 -0.0307588 -0.1162381 -0.0372128 -0.089455 -0.0302315 -0.0048469 0.0253089 0.0275576 0.0857046 0.0398829 0.0022112 0.0783835 0.1177649 0.099419 -0.1242089 0.0164931 -0.241659 0.0841441 -0.0030913 0.1607617 -0.0242872 -0.0666001 0.2277428 0.0970393 0.0755347 0.0337929 0.3898552 0.1318853 -0.0174615 0.0791412 0.4297771 0.0182103 -0.0275983 0.003251 0.0499709 -0.0386481 -0.070168 0.0186043 -0.0526886 0.0172905 -0.1696832 0.059547 -0.0196175 -0.0503412 0.0302522 -0.0213365 -0.048396 0.0207642 -0.1347864 -0.2045719 0.0103231 0.015591 0.0965536 0.0307775 -0.0414914 0.0318467 -0.0170975 -0.1488771 0.6967499 -0.4012425 0.0821537 -0.724748 0.3027162 -0.1179586 0.1221104 -0.1234612 0.0107527 0.9804453 0.2323572 -0.1126326 0.5207248 0.0638904 -0.0861046 -0.1612357 -0.0745756 0.0280616 -0.102376 0.0141076 0.0230623 -0.0003209 -0.0655384 0.0504902 -0.0021993 0.1312439 -0.2440508 0.0078657 -0.0680361 -0.0250644 -0.0221589 -0.1379641 -0.0743059 0.0092566 -0.1208134 0.0443549 -0.0108789 0.0706217 -0.0331993 0.0483011 0.0515898 0.034105 -0.0492075 0.0839538 -0.1083475 0.0527179 -0.0555005 -0.0644059 -0.0254603 -0.0328359 0.0194722 0.038456 -0.1122969 -0.2960642 -0.1482898 0.1385336 -0.0110029 0.1138586 -0.0405388 -0.0058266 -0.055058 0.0139759 0.0738792 -0.0051308 -0.0471754 0.03396 -0.0826242 0.0653243 0.0039924 0.1706651 0.0441712 0.2886698 0.101559 -0.0015977 0.0369313 -0.0036571 0.0795838 0.0740117 0.0167194 0.0020833 -0.1121537 0.0130445 0.1557371 -0.0380716 0.1100718 -0.0532231 0.0184188 -0.0475849 0.0531378 0.0607125 -0.1996297 -0.1401788 0.0155555 -0.092642 0.0388218 -0.0065359 0.0368326 -0.0052548 0.0771921 0.1106601 -0.0326494 0.0190383 -0.0132636 -0.0600478 0.0369129 0.0162084 0.0370834 0.1446457 0.090257 -0.0064004 0.0004323 -0.0334426 -0.0631762 0.0401455 0.0069066 0.032771 0.1498838 0.3130404 -0.091062 -0.0655249 -0.1207196 0.2146073 -0.1355583 -0.097491 -0.0540614 0.2961564 0.3651526 0.053536 0.0244466 0.0727304 0.1653654 -0.1503857 0.0756954 -0.08008 0.2947041 unknown
polarizability: 159.2293006|-1.5494215|128.5552069|-1.188437|-3.940298|71.9193969 unknown
InChI: InChI=1S/C10H13NO2/c1-6-8-5-10(13)9(12)4-7(8)2-3-11-6/h4-6,11-13H,2-3H2,1H3
charge 0 multiplicity 1
26 atoms
O  3.025142 -1.65015 0.270577
O  3.431961 1.133436 -0.227691
N  -2.948009 -0.018133 -0.093671
C  -1.924044 -1.022349 0.274745
C  -0.514356 -0.42802 0.129864
C  -1.487559 1.932533 -0.145363
C  -0.309735 0.968581 -0.0672
C  -2.742002 1.316678 0.501036
C  -2.140157 -2.278158 -0.600655
C  0.612079 -1.279166 0.257465
C  1.010931 1.46841 -0.192312
C  1.915276 -0.769983 0.155937
C  2.116796 0.609125 -0.111223
H  -2.029486 -1.332713 1.349189
H  -1.227795 2.888974 0.347899
H  -1.717319 2.155966 -1.205355
H  -2.608714 1.2828 1.611421
H  -3.628221 1.941698 0.28943
H  -3.899066 -0.383315 0.036068
H  -1.978518 -2.027753 -1.662707
H  -1.458622 -3.099019 -0.318808
H  -3.175393 -2.652428 -0.483464
H  0.495958 -2.348952 0.457049
H  1.18928 2.534676 -0.368293
H  3.742282 -1.213543 0.800032
H  3.989892 0.514402 -0.766869
