program: Gaussian 09
title: 000091656
version: EM64L-G09RevD.01
frameworkgroup: C1[X(C20H23N3O2)]
method: RPBEPBE
basis: SDD
operation: Freq
keyword: #p
keyword: freq=noraman
keyword: PBEPBE/SDD
title: #p freq=noraman PBEPBE/SDD
converged: YES YES NO NO
title: Mulliken charges:
elementType: O O N N N C C C C C C C C C C C C C C C C C C C C H H H H H H H H H H H H H H H H H H H H H H H
charge: -0.450720 -0.238358 -0.088993 -0.068288 -0.108558 0.306286 -0.072056 -0.155627 -0.770867 -0.718963 -0.733342 0.414415 -0.146166 -0.351611 -0.407770 -0.272308 0.358286 -0.405969 -0.372560 0.338754 -0.394716 -0.396067 -0.235099 -0.233363 -0.241751 0.181683 0.237491 0.205391 0.218445 0.228747 0.189922 0.254299 0.231788 0.259385 0.209753 0.195309 0.360442 0.278621 0.220662 0.261688 0.270484 0.240503 0.244358 0.235076 0.237589 0.226061 0.226846 0.230871
chargesum: 0.00000
title: Mulliken charges with hydrogens summed into heavy atoms:
elementType: O O N N N C C C C C C C C C C C C C C C C C C C C
charge: -0.090278 -0.238358 -0.088993 -0.068288 -0.108558 0.306286 0.109627 0.081864 -0.118284 -0.042954 -0.068896 0.414415 0.132455 -0.130949 -0.146082 -0.001824 0.358286 -0.165466 -0.128203 0.338754 -0.159641 -0.158477 -0.009038 -0.006517 -0.010881
polarizability: 3.58390594e+02 -2.20543661e+00 1.94329816e+02 -1.17502068e+01 1.50165456e+01 2.02587507e+02
1716.lowfreq: -8.0912 -2.5239 -0.0007 0.0004 0.0007 5.0454 12.4648 17.8599 32.1926
frequency: 12.1205 17.7736 32.1618 51.3130 58.8609 64.1835 73.4077 76.7680 107.1304 130.0835 152.7223 177.5891 192.6716 200.2439 226.5138 241.4678 258.7319 279.9559 289.2563 301.6376 314.2266 323.2518 347.5335 356.9489 374.0080 404.6594 412.3714 427.8704 441.0352 467.7428 510.9052 516.8148 546.6091 561.3765 614.0864 633.8584 644.7398 656.6044 672.6294 682.2092 701.8367 724.2779 732.6146 747.2989 769.6201 794.6698 807.4669 820.1184 836.5561 846.0463 849.5209 859.1914 864.6649 914.7869 917.7759 921.2595 934.1433 936.2566 942.0625 951.7834 957.9635 967.8014 972.9018 988.0367 991.6033 994.0265 996.5915 1011.7633 1014.0604 1033.6116 1041.0847 1085.5450 1088.4166 1115.1456 1122.0561 1146.1339 1164.1597 1173.9964 1181.4099 1192.3787 1194.9561 1213.1239 1226.5288 1245.4885 1252.1155 1284.5085 1291.3144 1302.8198 1305.3091 1308.5261 1312.7247 1330.6449 1342.6574 1356.5690 1360.2724 1370.7536 1375.3461 1375.5324 1395.6437 1418.4027 1426.4636 1431.9053 1439.3826 1453.1969 1466.1574 1472.0747 1473.7971 1477.0359 1489.2501 1501.8499 1510.6704 1572.0699 1589.2928 1613.0314 1619.8390 2880.3520 2957.2704 2971.7445 2988.9268 3031.0657 3046.5619 3061.9624 3069.1738 3084.5174 3097.2832 3110.8458 3122.5354 3125.9267 3130.5765 3139.3840 3143.1370 3148.6675 3153.0162 3165.5197 3171.1347 3251.9711 3259.7430 3296.4529
redmass: 5.2168 4.0058 3.3083 4.4093 5.4272 4.5406 4.4058 4.4332 4.6543 5.2265 5.8617 4.1057 1.3404 2.8434 3.5531 1.2172 1.5727 2.0975 2.1102 4.6986 5.1635 5.4755 2.9631 4.7318 2.4220 2.8442 2.9632 4.4666 2.8244 4.1853 3.4490 3.3646 3.2633 4.2117 6.4682 5.6905 3.1676 2.1109 4.6776 1.6643 1.7497 3.2953 4.6201 5.7212 1.8888 3.2466 1.6054 1.3704 3.6070 1.6837 1.3663 1.4097 3.3059 5.4402 1.4300 2.1745 1.7513 1.6592 1.3967 1.3967 4.1325 1.3752 1.4360 5.1155 5.2442 1.3292 4.0215 1.5517 2.8038 1.5260 1.8974 1.6242 4.0626 2.3220 1.3525 4.1555 1.9385 1.0526 1.4698 1.4105 1.5230 1.5767 2.5740 2.6862 2.6623 1.6917 2.6524 1.4254 1.5323 2.3118 1.5071 2.0911 1.8186 2.5263 1.4820 1.1960 1.4452 3.8991 1.2311 4.0754 1.7409 2.1658 2.4103 1.0509 1.0524 1.0509 1.9306 1.1142 1.0539 1.0729 2.7748 6.1087 6.6492 6.0339 6.4640 1.0816 1.0369 1.0369 1.0379 1.0839 1.0995 1.0983 1.0965 1.0970 1.0990 1.0995 1.0848 1.0872 1.0865 1.0915 1.0893 1.0959 1.0955 1.1016 1.0963 1.0969 1.1019 1.0664
irintensity: 0.0507 0.2072 0.2898 0.1306 0.0188 0.1338 0.1131 0.1385 3.3578 2.4768 1.1308 0.0451 0.0720 2.4496 1.9119 0.7962 0.6603 0.2479 1.0852 1.8469 0.4555 2.2882 3.5089 2.4762 0.0429 0.4798 1.2013 1.0878 2.2411 9.4954 13.1237 5.1606 3.3222 10.4122 0.1473 1.9985 68.1464 4.4491 0.9705 139.3238 46.0898 10.1125 21.3726 10.4402 79.6636 26.2880 27.6726 23.0577 44.9851 42.9327 5.5825 11.1494 21.4598 17.2133 1.8289 65.8824 44.0040 6.4795 2.2130 15.4535 34.6371 1.1400 0.1864 5.8410 24.5610 0.2250 73.7454 14.6391 5.1099 12.1026 9.6329 9.0402 30.9920 29.1559 10.2684 30.5566 253.0506 0.0271 25.4888 31.1994 14.8528 84.5585 21.6649 81.6356 9.4458 5.8770 2.2688 6.7688 10.6911 0.3243 3.7740 21.3442 15.7918 11.3881 32.4411 17.4208 16.4279 5.3287 11.0444 6.7374 57.0973 98.9063 5.2007 1.1976 1.4707 3.7088 124.1997 22.0273 11.3340 37.4017 59.6164 1.8366 4.7935 19.0000 38.8394 60.4976 31.1723 40.5002 34.0128 25.3021 37.2179 39.8015 42.2876 47.5619 19.3483 21.5931 12.6110 0.3905 26.9793 14.8118 5.6966 36.2339 20.9858 28.0238 2.2798 1.5580 0.9888 297.2959
temp: 298.150 k
press: 1.00000 atm
elementType: 8 8 7 7 7 6 6 6 6 6 6 6 6 6 6 6 6 6 6 6 6 6 6 6 6 1 1 1 1 1 1 1 1 1 1 1 1 1 1 1 1 1 1 1 1 1 1 1
symmnumber: 1
zpe: 1023834.3 jmol-1
zpe.correction: 0.389958 hartree
zpe.thermalcorrener: 0.413214 hartree
zpe.thermalcorrenthalpy: 0.414158 hartree
zpe.thermalcorrgfe: 0.334778 hartree
zpe.sumelectzpe: -1088.774708 hartree
zpe.sumelectthermal: -1088.751452 hartree
zpe.sumelectthermalent: -1088.750508 hartree
zpe.sumelectthermalfe: -1088.829888 hartree
dipole: 1.9742 -1.0434 -2.4680
dipole: 3.3283
quadrupole: -143.2671 -158.5472 -141.0288
quadrupole: -1.0330 8.1861 9.8952
quadrupole: 4.3473 -10.9329 6.5856 -1.0330 8.1861 9.8952
hfenergy: -1089.1646655 hartree
pointgroup: C01[X(C20H23N3O2)]
dipole: 0.74565 0.5302741 0.9367346 debye
polarizability: 357.5856709|10.1131918|197.7013144|12.2883487|16.096491|200.0209317 unknown
InChI: InChI=1S/C20H23N3O2/c1-20(2,3)18(24)19(23-14-21-13-22-23)25-17-11-9-16(10-12-17)15-7-5-4-6-8-15/h4-14,18-19,24H,1-3H3
charge 0 multiplicity 1
48 atoms
O  -4.410663 -0.31258 -1.2448
O  -1.602333 0.161079 -0.660338
N  -2.480062 -1.699509 0.585291
N  -3.178351 -2.555593 -0.284129
N  -1.981325 -3.778926 1.271732
C  -4.208321 1.775555 0.015987
C  -3.970667 0.228559 0.028959
C  -2.527425 -0.228662 0.393962
C  -3.637406 2.421079 1.306457
C  -3.588169 2.4450 -1.23709
C  -5.749858 1.97694 -0.012781
C  -0.210956 0.196883 -0.389834
C  -1.772126 -2.460828 1.495096
C  0.369943 0.321717 0.894716
C  0.61459 0.165426 -1.537125
C  -2.842771 -3.785282 0.178634
C  2.625075 0.376373 -0.120502
C  1.773583 0.407678 1.015048
C  2.010389 0.25764 -1.399522
C  4.106447 0.465331 0.019459
C  4.700169 1.231495 1.061064
C  4.968712 -0.215019 -0.884939
C  6.102419 1.312635 1.195549
C  6.371227 -0.131952 -0.754017
C  6.946811 0.631676 0.288013
H  -4.591404 -0.186026 0.862553
H  -2.244268 0.213973 1.365942
H  -3.988438 1.899256 2.21943
H  -2.530684 2.439467 1.308637
H  -3.975807 3.470651 1.377381
H  -3.868846 3.514841 -1.264037
H  -3.962217 1.954284 -2.150484
H  -2.48837 2.369156 -1.239191
H  -6.187733 1.450014 -0.877057
H  -5.994011 3.052238 -0.092588
H  -6.224419 1.587097 0.908843
H  -4.17671 -1.290102 -1.243904
H  -1.136932 -2.042706 2.270532
H  -0.238967 0.362654 1.804127
H  0.141781 0.080688 -2.520011
H  -3.227171 -4.693662 -0.276185
H  2.212535 0.472555 2.016694
H  2.632251 0.262586 -2.301085
H  4.060807 1.794222 1.751154
H  4.538631 -0.838514 -1.677209
H  6.536414 1.915824 2.000953
H  7.014593 -0.671589 -1.45805
H  8.035631 0.69528 0.390865
