program: Gaussian 09
title: 000091567
version: EM64L-G09RevD.01
frameworkgroup: C1[X(C19H22O7)]
method: RPBEPBE
basis: SDD
operation: Freq
keyword: #pfreq=noraman
keyword: PBEPBE/SDD
title: #p freq=noraman PBEPBE/SDD
converged: NO YES NO NO
title: Mulliken charges:
elementType: O O O O O O O C C C C C C C C C C C C C C C C C C C H H H H H H H H H H H H H H H H H H H H H H
charge: -0.301248 -0.234477 -0.455111 -0.289558 -0.194152 -0.276999 -0.227355 0.449668 -0.257395 -0.187202 -0.251202 -0.206836 -0.478386 -0.606886 -0.200785 0.598120 -0.053870 -0.660690 0.298603 0.085396 -0.792081 -0.695236 0.214548 0.282963 -0.385283 -0.728251 0.278962 0.259409 0.245766 0.302790 0.224333 0.269567 0.240178 0.235734 0.278478 0.250327 0.255782 0.243018 0.345943 0.229433 0.229935 0.232200 0.264443 0.235650 0.221462 0.229878 0.249917 0.230500
chargesum: 0.00000
title: Mulliken charges with hydrogens summed into heavy atoms:
elementType: O O O O O O O C C C C C C C C C C C C C C C C C C C
charge: -0.301248 -0.234477 -0.109167 -0.289558 -0.194152 -0.276999 -0.227355 0.449668 0.021567 0.072206 -0.005436 0.095954 0.015514 -0.130974 0.077694 0.598120 0.196457 -0.161890 0.298603 0.085396 -0.332713 -0.198593 0.214548 0.282963 0.071829 -0.017957
polarizability: 2.32509181e+02 1.05185571e+01 2.26415344e+02 -1.94809971e+01 1.12753537e+01 1.84066140e+02
1716.lowfreq: -9.6158 -1.7567 -0.0006 0.0007 0.0008 3.6555 10.6669 27.9423 30.0918
frequency: 9.3628 27.8092 30.0529 44.2889 50.1101 59.3500 74.0274 92.0394 112.8967 141.2711 156.6890 157.0578 173.2971 184.9183 214.0890 229.8558 243.2547 267.7410 270.8312 292.1393 298.9137 303.7931 318.8711 319.6514 337.8109 351.9959 361.3163 367.1584 389.9105 415.2563 442.2569 467.6166 480.8375 495.6458 523.0466 539.4140 563.7356 577.3261 584.3168 623.6603 651.8542 681.7200 691.9612 701.9000 712.8929 738.0591 769.1588 778.9771 784.3367 786.8199 808.5248 821.0462 845.2814 856.4126 868.3362 876.3657 892.2472 906.5614 911.3465 918.4725 933.0577 939.0434 956.5467 982.2332 984.5070 996.0445 998.2694 1005.4064 1010.3003 1033.6196 1048.3516 1050.2637 1059.5047 1077.3280 1078.9827 1103.4725 1105.9401 1131.3216 1131.7502 1137.1882 1149.9216 1170.2823 1197.6058 1213.5274 1220.0794 1223.3657 1235.1710 1251.2917 1260.9695 1269.2385 1285.5883 1287.9589 1293.6296 1301.5593 1329.5974 1332.9492 1336.9115 1340.7859 1348.3412 1350.0647 1363.9905 1371.0260 1399.6319 1411.3513 1424.1857 1434.8505 1454.9835 1460.2384 1465.7183 1466.0090 1470.5416 1484.0441 1623.8675 1661.4318 1673.0373 1690.6734 2966.5244 2971.8158 2975.3830 2998.4026 3002.9770 3008.7558 3012.8175 3022.1553 3061.2501 3063.8322 3067.8652 3078.8017 3085.1242 3097.9458 3098.4154 3099.6607 3114.5919 3180.3661 3198.0508 3202.1858 3206.2006 3562.1011
redmass: 4.0136 5.9562 5.0946 5.0336 5.9082 6.6493 6.4045 6.3942 5.0855 5.1319 5.5470 3.7861 1.1183 5.5748 5.2827 2.8516 3.8670 1.2892 3.3768 4.0187 3.8698 3.7271 4.6355 4.9627 3.7372 3.9231 3.5661 3.4705 3.7231 3.7934 2.9635 4.3344 3.6883 4.9731 3.7366 3.0321 4.0992 3.6664 2.3047 4.6375 4.7673 7.1485 3.7842 1.6206 4.6790 4.2333 4.2068 4.6782 3.0275 2.7285 3.4921 3.7358 3.6426 3.6472 2.8660 3.6721 1.8023 1.4499 2.0490 5.2613 1.8038 1.9915 2.1104 1.4680 1.7315 2.8092 2.0424 1.9631 2.4338 3.1864 1.3569 2.4438 1.3199 1.6732 3.1984 2.8826 2.4963 1.3401 1.3231 1.4749 1.4767 1.4890 1.3065 1.4681 1.4622 1.4579 1.6678 1.7026 1.7056 1.5089 2.4154 1.8069 1.5443 1.6177 1.5445 3.2525 1.7448 1.5576 1.5500 1.4049 1.5493 1.4765 1.2920 2.5832 1.1716 1.1774 1.0518 1.0884 1.0898 1.0873 1.1569 1.2440 11.1894 5.3590 6.6197 11.7908 1.0805 1.0812 1.0667 1.0618 1.0364 1.0839 1.0845 1.0861 1.0939 1.1038 1.0533 1.0567 1.0888 1.0631 1.0983 1.0621 1.1009 1.1185 1.1132 1.1159 1.1152 1.0662
irintensity: 1.3632 0.3543 0.6164 0.9287 1.4372 2.7323 3.3102 1.3571 0.8510 1.5236 1.0750 8.1991 0.1310 2.9288 1.1768 10.9603 2.2817 146.7947 22.2282 3.5828 3.5660 1.2580 14.8182 3.2570 5.6916 1.2409 6.8712 0.7395 4.2448 14.9637 7.0164 0.9254 1.4722 13.0841 14.5209 0.8238 4.9350 1.5807 14.1036 3.2694 4.8607 21.3959 4.3773 4.2878 20.6159 0.4802 12.6461 0.8943 15.1016 1.1076 3.1836 5.8764 6.1663 8.7822 19.3736 3.8914 37.4149 1.7574 7.1112 113.9499 48.0732 24.0467 10.9021 35.9036 20.7334 67.1742 46.1549 9.8198 12.8668 189.3716 4.1575 9.7009 3.1440 33.5340 15.5992 299.3949 26.2625 35.3876 2.1737 69.2962 20.9609 8.9650 7.3511 3.9201 26.2495 8.4497 6.3120 10.7835 66.5092 1.9122 55.4940 29.7654 3.1298 0.6957 2.4388 7.4537 4.1763 5.7656 0.5267 6.2130 0.6244 2.3764 27.8897 4.1559 32.0368 8.3473 10.7284 26.2326 8.0655 10.4467 5.7281 6.9482 170.6729 34.6673 23.7150 275.9165 6.8632 5.0705 8.2259 13.5558 10.6082 8.0869 18.0460 48.6703 8.7237 22.3120 23.2132 26.0036 7.1119 5.2502 14.2051 3.6491 11.1034 21.7004 15.6208 5.8866 3.0266 3.6607
temp: 298.150 k
press: 1.00000 atm
elementType: 8 8 8 8 8 8 8 6 6 6 6 6 6 6 6 6 6 6 6 6 6 6 6 6 6 6 1 1 1 1 1 1 1 1 1 1 1 1 1 1 1 1 1 1 1 1 1 1
symmnumber: 1
zpe: 991038.3 jmol-1
zpe.correction: 0.377467 hartree
zpe.thermalcorrener: 0.402101 hartree
zpe.thermalcorrenthalpy: 0.403045 hartree
zpe.thermalcorrgfe: 0.321427 hartree
zpe.sumelectzpe: -1261.710779 hartree
zpe.sumelectthermal: -1261.686145 hartree
zpe.sumelectthermalent: -1261.685200 hartree
zpe.sumelectthermalfe: -1261.766819 hartree
dipole: -4.6805 -4.5308 1.6913
dipole: 6.7302
quadrupole: -174.3534 -137.9378 -160.6426
quadrupole: -1.8637 -1.8246 8.9789
quadrupole: -16.7088 19.7068 -2.9980 -1.8637 -1.8246 8.9789
hfenergy: -1262.0882458 hartree
pointgroup: C01 [X(C19H22O7)]
dipole: -1.8533853 -1.8270381 0.4879298 debye
polarizability: 232.2100595|12.7992979|223.0749658|-18.6912655|15.7417719|187.7056395 unknown
InChI: InChI=1S/C19H22O7/c1-8-4-11(25-17(22)18(3)6-23-18)13-9(2)16(21)26-15(13)14-10(8)5-12(20)19(14)7-24-19/h10-15,20H,1-2,4-7H2,3H3
charge 0 multiplicity 1
48 atoms
O  4.043701 -1.659638 0.386071
O  2.497427 1.357626 -1.219229
O  1.417365 -2.805159 -1.950719
O  -1.848156 0.466468 -0.213629
O  3.507398 3.321112 -0.474941
O  -3.826858 0.017237 -2.236427
O  -3.580192 1.175289 1.178002
C  2.75269 -1.547073 -0.395801
C  1.709379 -0.556101 0.163327
C  0.473777 -1.467338 0.525908
C  2.062998 -2.889961 -0.619461
C  1.288594 0.538167 -0.839184
C  4.040845 -1.207761 -1.061575
C  1.024935 -2.916422 0.518081
C  0.280111 1.622702 -0.32186
C  -0.287483 -1.027895 1.764613
C  -0.872305 1.24189 0.624242
C  -0.530598 0.4711 1.921705
C  1.204433 2.701948 0.228514
C  2.525069 2.560158 -0.47135
C  -0.763937 -1.897754 2.692566
C  0.979825 3.685797 1.132923
C  -4.096302 -0.232643 -0.757198
C  -3.183474 0.537449 0.174828
C  -3.514536 -1.316846 -1.62562
C  -5.554233 -0.25614 -0.348686
H  2.141225 -0.085107 1.067453
H  -0.229899 -1.386692 -0.329058
H  2.784403 -3.728496 -0.584188
H  0.94613 0.069326 -1.775036
H  4.475155 -1.930584 -1.763452
H  4.301228 -0.157472 -1.213279
H  1.543343 -3.144138 1.469042
H  0.235719 -3.67493 0.364118
H  -0.203695 2.039702 -1.230235
H  -1.389576 2.176637 0.915265
H  -1.34768 0.63313 2.645501
H  0.372075 0.954891 2.349141
H  0.952606 -3.660937 -2.13343
H  -0.576167 -2.974675 2.632649
H  -1.349617 -1.551723 3.55218
H  0.02206 3.817821 1.647767
H  1.783275 4.393308 1.367942
H  -2.446147 -1.549149 -1.5577
H  -4.180257 -2.134458 -1.931089
H  -5.678168 -0.78583 0.612565
H  -5.941415 0.768103 -0.219866
H  -6.15147 -0.767639 -1.121389
