program: Gaussian 09
title: 000091565
version: EM64L-G09RevD.01
frameworkgroup: C1[X(C16H21NO3)]
method: RPBEPBE
basis: SDD
operation: Freq
keyword: #p
keyword: freq=noraman
keyword: PBEPBE/SDD
title: #p freq=noraman PBEPBE/SDD
converged: YES YES NO NO
title: Mulliken charges:
elementType: O O O N C C C C C C C C C C C C C C C C H H H H H H H H H H H H H H H H H H H H H
charge: -0.320777 -0.448070 -0.421980 -0.339648 -0.128006 -0.427310 -0.025788 -0.299240 0.229696 -0.718763 -0.659397 0.182055 0.335246 -0.350657 0.064383 -0.389681 -0.393898 -0.356641 -0.236580 -0.266555 0.213509 0.217984 0.232858 0.188630 0.251809 0.239728 0.227703 0.208016 0.218060 0.223023 0.222115 0.201739 0.216310 0.254456 0.350080 0.257528 0.248920 0.186545 0.230912 0.229599 0.352089
chargesum: 0.00000
title: Mulliken charges with hydrogens summed into heavy atoms:
elementType: O O O N C C C C C C C C C C C C C C C C
charge: -0.320777 -0.097990 -0.069891 -0.087839 0.085503 0.023532 0.162842 0.168190 0.229696 -0.069665 -0.019233 0.182055 0.335246 -0.096201 0.064383 -0.132153 -0.144978 -0.170095 -0.005669 -0.036956
polarizability: 2.34156650e+02 8.01872175e+00 1.85946510e+02 -3.11256514e+01 3.70743451e+01 1.67385927e+02
1716.lowfreq: -10.0495 -1.2763 -0.0005 -0.0003 0.0003 8.3090 9.1131 18.8933 22.1471
frequency: -1.5556 18.0613 21.9098 46.1006 82.6766 89.6083 99.4908 117.6549 151.9972 166.1216 194.7041 199.3932 208.9233 222.5582 241.4082 263.8389 282.2473 314.1420 333.2066 370.2722 382.9864 415.1328 416.2377 420.1637 441.7191 454.5817 466.2946 470.7940 502.7290 534.2668 576.3865 593.6678 615.2646 636.8767 666.9474 701.4436 751.7090 760.2507 773.8441 792.1625 811.7724 816.9589 843.3485 859.8712 903.5683 913.7111 918.2189 930.8524 943.8994 951.5190 951.9823 990.3752 1001.8573 1015.3025 1040.6663 1053.2801 1078.7409 1087.6987 1107.3757 1135.5923 1137.3449 1154.7862 1155.7765 1170.9633 1178.9147 1180.1584 1216.7753 1222.3580 1238.4196 1249.2995 1267.8136 1279.7674 1310.2849 1332.1322 1338.3230 1349.9476 1368.1176 1373.5511 1378.3386 1384.8527 1388.2142 1389.2942 1426.3525 1439.7798 1448.1120 1451.7998 1462.1164 1464.2614 1466.8104 1477.0338 1483.5674 1488.6015 1523.2804 1589.9607 1607.7743 1638.6213 2862.4848 2926.0493 2972.9403 2979.5598 2981.2949 3028.6631 3055.9714 3059.4714 3064.9680 3075.5460 3082.3077 3089.1200 3091.2270 3136.3777 3155.8330 3162.2733 3173.3030 3181.1158 3429.6797 3534.0302 3594.9826
redmass: 3.0675 3.6319 4.8322 4.3802 4.8631 2.0356 3.0180 3.9687 5.1704 4.1386 1.5532 2.3204 1.8991 1.8424 1.1160 4.8535 3.2650 3.1572 4.2414 4.3432 2.4897 2.0896 2.1160 1.5606 3.8480 2.9166 3.4854 5.7204 2.9218 5.0816 4.3708 2.9937 3.8510 3.5752 1.4847 6.0573 5.6195 1.4163 3.3240 4.5622 2.5879 1.4302 3.1171 1.6166 2.7552 1.2122 1.4920 2.0019 2.1170 1.3992 1.5374 1.3327 1.9501 3.6958 1.9308 4.3578 2.2082 2.8217 1.9377 2.0849 1.5624 1.4539 1.6174 1.4455 1.7926 1.2310 1.4080 1.4486 1.8876 1.2562 1.6846 2.6380 1.3001 1.4695 1.2958 1.2989 1.3243 1.3137 1.3648 3.4226 1.9012 1.3312 5.8033 2.6030 1.7060 1.1212 1.2723 1.2998 1.0565 1.0946 1.0822 1.0584 4.2058 6.5452 6.4675 6.8857 1.0825 1.0698 1.0362 1.0357 1.0554 1.0850 1.1067 1.0922 1.0987 1.0991 1.1000 1.0991 1.0880 1.0877 1.0940 1.0880 1.0981 1.0957 1.0743 1.0653 1.0656
irintensity: 0.2502 0.0140 0.1843 0.1040 0.8833 17.0326 5.9710 0.7152 3.6921 6.7342 3.2564 30.1133 59.5643 4.7088 0.8385 1.4243 0.1895 7.7538 4.8229 2.2210 2.0896 20.2401 47.7527 98.8041 10.6595 19.7871 0.5616 0.3262 3.2404 10.0269 19.8667 4.9586 11.3292 0.7198 59.9424 8.5838 32.3071 98.2951 1.3740 6.5447 4.4861 45.8298 20.3093 0.9883 42.2951 3.9550 3.1801 4.6856 6.7298 0.8671 1.8244 0.0502 46.0538 23.6980 7.0485 132.2071 76.9381 9.2036 20.6616 42.2122 179.7764 2.9806 31.9922 44.8668 39.2706 23.5545 9.3029 43.4304 94.8128 7.6786 57.2551 1.5768 14.6856 9.4880 6.7210 10.6676 7.4910 22.9140 71.7267 3.7609 106.2830 67.3009 49.7791 16.4297 110.5916 17.5551 7.1064 7.5824 1.5731 8.9284 5.8351 16.7562 0.2980 36.3644 14.5860 1.3339 85.6425 77.8681 39.9634 16.5551 23.1132 27.6878 19.1532 32.6856 42.6502 41.2222 20.5559 58.5486 20.8088 9.7289 22.2999 14.2640 19.1131 5.4900 1.6170 14.6059 26.8168
temp: 298.150 k
press: 1.00000 atm
elementType: 8 8 8 7 6 6 6 6 6 6 6 6 6 6 6 6 6 6 6 6 1 1 1 1 1 1 1 1 1 1 1 1 1 1 1 1 1 1 1 1 1
symmnumber: 1
zpe: 890171.6 jmol-1
zpe.correction: 0.339048 hartree
zpe.thermalcorrener: 0.358594 hartree
zpe.thermalcorrenthalpy: 0.359538 hartree
zpe.thermalcorrgfe: 0.290088 hartree
zpe.sumelectzpe: -901.197928 hartree
zpe.sumelectthermal: -901.178382 hartree
zpe.sumelectthermalent: -901.177438 hartree
zpe.sumelectthermalfe: -901.246888 hartree
dipole: 0.5888 -0.4286 2.0251
dipole: 2.1521
quadrupole: -102.6462 -125.6761 -119.6063
quadrupole: -9.8128 -5.6616 9.3573
quadrupole: 13.3300 -9.6999 -3.6301 -9.8128 -5.6616 9.3573
hfenergy: -901.5369763 hartree
pointgroup: C01 [X(C16H21N1O3)]
dipole: 0.1708158 -0.8149575 -0.1534618 debye
polarizability: 237.5253295|22.46089|160.6891041|-2.0942165|-39.7290618|189.2746537 unknown
InChI: InChI=1S/C16H21NO3/c1-11(2)17-9-12(18)10-20-16-8-7-15(19)13-5-3-4-6-14(13)16/h3-8,11-12,17-19H,9-10H2,1-2H3
charge 0 multiplicity 1
41 atoms
O  0.57578 0.853705 0.488253
O  2.665462 1.99635 1.945151
O  -4.725306 0.532341 -1.459348
N  3.8888 -0.267342 -0.823463
C  2.873995 1.534347 0.56457
C  3.45234 0.098134 0.54219
C  3.962814 -1.724381 -1.134437
C  1.580311 1.65077 -0.24871
C  -0.72961 0.794937 -0.033116
C  4.836249 -1.91524 -2.391121
C  2.548227 -2.304013 -1.356428
C  -1.65662 -0.015012 0.716144
C  -3.027461 -0.12618 0.25886
C  -1.142165 1.458096 -1.193896
C  -3.416912 0.579181 -0.938833
C  -1.257992 -0.715931 1.899357
C  -2.490015 1.346849 -1.642608
C  -3.936455 -0.936243 1.016348
C  -2.169149 -1.496657 2.614974
C  -3.522205 -1.607304 2.169557
H  3.616423 2.236492 0.141226
H  2.661333 -0.60347 0.861788
H  4.26469 0.0490 1.302272
H  4.440757 -2.285805 -0.29263
H  4.770874 0.203405 -1.069621
H  1.73437 1.230634 -1.260739
H  1.243337 2.704358 -0.301425
H  5.8716 -1.560506 -2.222266
H  4.886086 -2.981435 -2.673988
H  4.408518 -1.349628 -3.239694
H  1.889575 -2.126534 -0.487432
H  2.599003 -3.39586 -1.524506
H  2.08044 -1.828839 -2.237621
H  -0.446083 2.068648 -1.774045
H  1.818372 1.586903 2.262949
H  -0.218823 -0.628856 2.228418
H  -2.816678 1.865893 -2.547969
H  -4.983241 -1.047832 0.701411
H  -1.84951 -2.027256 3.518172
H  -4.233629 -2.220845 2.732522
H  -5.3206 -0.015374 -0.892063
