program: Gaussian 09
title: 000091572
version: EM64L-G09RevD.01
frameworkgroup: C1[X(C20H18O4)]
method: RPBEPBE
basis: SDD
operation: Freq
keyword: #pfreq=noraman
keyword: PBEPBE/SDD
title: #p freq=noraman PBEPBE/SDD
converged: YES YES NO NO
title: Mulliken charges:
elementType: O O O O C C C C C C C C C C C C C C C C C C C C H H H H H H H H H H H H H H H H H H
charge: -0.267265 -0.237227 -0.285398 -0.430560 -0.267817 -0.252992 0.242472 -0.369739 0.076030 0.358584 0.212573 0.194326 -0.404327 0.158593 0.233184 -0.423353 -0.331353 -0.317876 -0.224662 -0.504267 -0.696946 -0.717874 -0.429898 0.329587 0.244840 0.245703 0.226220 0.213362 0.232279 0.249657 0.245065 0.259196 0.229786 0.275852 0.240053 0.228991 0.214299 0.233266 0.239816 0.200954 0.221419 0.355448
chargesum: 0.00000
title: Mulliken charges with hydrogens summed into heavy atoms:
elementType: O O O O C C C C C C C C C C C C C C C C C C C C
charge: -0.267265 -0.237227 -0.285398 -0.075112 -0.022977 -0.007289 0.242472 0.069843 0.076030 0.358584 0.212573 0.194326 -0.172047 0.158593 0.233184 -0.173696 -0.086288 -0.058679 0.005124 -0.228415 -0.013603 -0.043838 -0.208480 0.329587
polarizability: 2.93436524e+02 4.77788969e+00 2.33152483e+02 2.05532826e+00 -1.68677549e+01 1.73122990e+02
1716.lowfreq: -0.0006 0.0005 0.0006 4.4495 5.4295 15.4886 22.5082 37.7260 55.1459
frequency: 22.3740 37.6054 55.1233 71.3097 100.2536 123.9705 162.6147 185.2178 190.5986 216.4473 241.5622 249.8161 263.6719 272.9466 276.9239 290.5467 320.4456 343.8077 359.9029 362.4912 393.7429 414.7589 434.9180 445.6681 459.6600 465.4925 486.0615 509.3581 519.1058 548.1271 564.5375 581.6258 605.6177 612.3351 633.2190 643.6805 682.8642 693.9045 714.1197 719.8017 743.0345 760.1623 778.8500 789.5400 801.5493 814.6515 838.8977 854.6687 864.6692 866.0260 883.5890 915.5087 918.8860 927.5513 931.2315 933.0624 942.3591 968.0852 988.8535 996.7888 1009.9657 1050.8080 1088.6200 1105.5598 1109.3470 1138.0453 1143.4199 1164.2706 1177.8929 1195.6664 1204.9300 1209.6803 1217.2074 1226.5390 1239.4435 1245.5491 1255.4133 1261.9948 1275.8183 1283.1361 1300.4764 1321.6022 1368.2763 1374.5540 1376.9778 1395.3576 1400.4214 1401.0803 1439.6309 1445.2298 1451.4571 1457.1878 1460.8826 1469.3026 1472.4524 1482.4043 1496.0151 1587.5730 1592.7748 1625.4452 1637.1979 1647.6281 2963.0298 2979.1393 2983.2141 2994.1343 3057.4979 3083.3077 3089.4000 3091.6436 3093.9939 3104.6987 3121.8750 3128.6900 3133.5972 3146.9899 3159.9607 3173.2250 3187.0766 3584.2538
redmass: 6.1459 4.6195 3.6801 4.6832 7.2802 3.9396 4.2179 1.3940 2.4372 4.3444 3.9161 1.1384 3.7098 4.3745 3.2539 3.9357 3.2512 3.8456 3.8449 1.1546 4.7001 4.0007 3.2530 4.0656 3.4260 3.5935 5.7627 5.5947 5.3682 5.2555 5.2890 4.3451 5.3210 4.8297 4.4045 4.6212 6.2277 4.1453 4.6199 3.1771 2.6473 4.7764 1.8432 2.3394 2.0103 3.2914 4.5975 3.9314 1.8118 2.8090 4.1844 2.5870 1.8903 1.5103 1.5108 1.9464 1.8041 1.3068 3.6808 1.3106 3.9388 2.1135 1.9924 1.8553 1.5280 1.4724 1.3885 1.9421 1.6294 1.9841 1.4430 2.0424 1.9834 1.5669 1.8213 1.7816 2.0212 2.8310 2.0351 1.8628 2.0222 1.6499 1.6474 1.3378 1.3508 1.2580 6.8231 7.0790 3.6521 2.5866 1.0653 2.8564 1.1138 1.1335 1.2174 1.0712 3.1774 7.6355 7.7431 9.2797 6.8376 7.9824 1.0778 1.0737 1.0346 1.0356 1.0880 1.0996 1.0966 1.1010 1.0993 1.1007 1.0876 1.0862 1.0899 1.0967 1.0993 1.0945 1.0927 1.0660
irintensity: 0.4605 0.8642 0.3149 2.9387 1.4789 3.1224 4.4734 0.6246 1.7232 1.9065 3.0709 0.0079 0.4739 1.1132 1.1041 5.1185 2.2732 0.1002 11.7673 135.6863 2.9118 2.5382 2.8503 7.0657 2.6370 3.0706 4.0201 13.8748 3.2711 7.6147 7.4968 5.4462 0.7376 18.7524 1.2018 8.3078 3.1081 6.8464 8.6367 6.9927 45.1780 3.0931 62.6476 28.6515 27.5234 19.4631 50.8679 1.1856 16.4130 48.9314 0.9275 38.5338 13.6112 9.0239 4.0378 19.1112 4.3863 1.0514 70.5456 0.6725 279.3506 22.1151 3.9065 314.9904 90.8329 21.5870 39.3640 19.8328 29.4435 32.6781 24.9229 8.0154 47.6845 6.8936 16.8934 14.0501 26.1916 18.8667 11.1689 18.0908 5.4240 10.8695 47.1016 43.5206 45.5163 11.0075 38.1621 15.7986 76.2134 92.9514 6.3468 32.9826 11.0292 4.1443 30.0259 16.7356 35.7831 49.3598 48.1023 15.6987 202.6366 85.6765 3.9804 111.2725 18.5388 26.2474 35.8483 7.8065 21.2644 24.0222 28.4209 29.4970 12.8309 2.7171 10.1133 11.1391 13.9652 6.9351 0.2248 48.7555
temp: 298.150 k
press: 1.00000 atm
elementType: 8 8 8 8 6 6 6 6 6 6 6 6 6 6 6 6 6 6 6 6 6 6 6 6 1 1 1 1 1 1 1 1 1 1 1 1 1 1 1 1 1 1
symmnumber: 1
zpe: 865361.6 jmol-1
zpe.correction: 0.329599 hartree
zpe.thermalcorrener: 0.349439 hartree
zpe.thermalcorrenthalpy: 0.350383 hartree
zpe.thermalcorrgfe: 0.281666 hartree
zpe.sumelectzpe: -1072.097678 hartree
zpe.sumelectthermal: -1072.077838 hartree
zpe.sumelectthermalent: -1072.076894 hartree
zpe.sumelectthermalfe: -1072.145610 hartree
dipole: 0.2425 -0.4244 3.1194
dipole: 3.1574
quadrupole: -128.2717 -117.0209 -143.5014
quadrupole: -1.2355 7.7303 -1.6237
quadrupole: 1.3263 12.5771 -13.9034 -1.2355 7.7303 -1.6237
hfenergy: -1072.4272768 hartree
pointgroup: C01 [X(C20H18O4)]
dipole: -0.0539973 -0.1244366 -1.2348001 debye
polarizability: 292.6963916|-7.5635822|232.4050976|6.908231|18.4091264|174.6105084 unknown
InChI: InChI=1S/C20H18O4/c1-20(2)8-7-14-16(24-20)6-5-12-15-10-22-17-9-11(21)3-4-13(17)19(15)23-18(12)14/h3-9,15,19,21H,10H2,1-2H3
charge 0 multiplicity 1
42 atoms
O  -0.20148 -0.037131 -1.647302
O  -2.697002 1.649876 1.013521
O  3.7580 -0.191564 1.289201
O  -5.34608 -2.32102 1.269095
C  -1.026791 2.121962 -0.804112
C  -1.463736 0.831099 -1.573651
C  0.236659 1.662619 -0.083655
C  -2.153237 2.663563 0.089026
C  0.660201 0.439414 -0.641105
C  -2.55537 0.049603 -0.873461
C  1.834999 -0.228207 -0.241062
C  -3.071554 0.446327 0.392284
C  0.998625 2.260411 0.934933
C  2.603527 0.417996 0.779204
C  4.480863 -1.191396 0.405717
C  2.191104 1.631542 1.373162
C  -3.023386 -1.167007 -1.425066
C  2.25454 -1.545397 -0.716583
C  3.479951 -2.035044 -0.375043
C  -3.993986 -0.353541 1.096928
C  5.386572 -0.38473 -0.555397
C  5.301153 -2.030413 1.39792
C  -3.951078 -1.979985 -0.748345
C  -4.423865 -1.566087 0.525473
H  -0.77575 2.92187 -1.531128
H  -1.706723 1.017749 -2.632474
H  -1.792477 3.471864 0.74524
H  -2.986639 3.047833 -0.535328
H  0.685836 3.205205 1.39358
H  2.805178 2.064671 2.167314
H  -2.625911 -1.492488 -2.393104
H  1.551055 -2.127229 -1.320637
H  3.805764 -3.035822 -0.681542
H  -4.375589 -0.030893 2.068219
H  4.777902 0.270937 -1.202275
H  6.095313 0.238166 0.019255
H  5.960787 -1.069738 -1.205673
H  5.956773 -1.375746 1.997065
H  4.634527 -2.580434 2.08304
H  5.931117 -2.75697 0.85351
H  -4.295215 -2.920988 -1.1948
H  -5.585577 -3.152676 0.789957
