program: Gaussian 09
title: 000091636
version: EM64L-G09RevD.01
frameworkgroup: C1[X(C16H15ClN5O6PS)]
method: RPBEPBE
basis: SDD
operation: Freq
keyword: #p
keyword: freq=noraman
keyword: PBEPBE/SDD
title: #p freq=noraman PBEPBE/SDD
converged: YES YES NO NO
title: Mulliken charges:
elementType: Cl S P O O O O O O N N N N N C C C C C C C C C C C C C C C C H H H H H H H H H H H H H H H
charge: -0.036464 0.283196 1.412623 -0.238411 -0.446525 -0.462741 -0.437888 -0.701515 -0.565355 -0.201223 0.012047 -0.236041 -0.032267 -0.600889 -0.245257 0.016012 -0.178049 -0.078840 -0.369672 0.271071 -0.182645 -0.131217 0.129110 -0.294596 -0.159981 -0.198816 -0.195104 -0.197554 -0.190732 -0.100997 0.248119 0.265545 0.261594 0.265898 0.238129 0.258126 0.370858 0.424622 0.270627 0.353927 0.344357 0.263652 0.264096 0.264285 0.264885
chargesum: 0.00000
title: Mulliken charges with hydrogens summed into heavy atoms:
elementType: Cl S P O O O O O O N N N N N C C C C C C C C C C C C C C C C
charge: -0.036464 0.283196 1.412623 -0.238411 -0.446525 -0.462741 -0.067031 -0.276893 -0.565355 -0.201223 0.012047 -0.236041 -0.032267 0.097395 0.002862 0.281557 0.083545 0.187059 0.126582 0.271071 -0.182645 -0.131217 0.129110 -0.023970 -0.159981 0.064836 0.068992 0.066731 0.074153 -0.100997
polarizability: 4.18824065e+02 -1.05964999e+01 2.58729152e+02 -2.56432356e+00 -1.91219951e-01 1.83625134e+02
1716.lowfreq: -2.1542 0.0014 0.0019 0.0027 3.0154 4.0568 8.2757 16.6132 23.6455
frequency: 7.2546 16.5105 23.5973 31.8203 50.2043 72.1480 83.7976 95.0718 105.5480 111.7704 141.6183 152.1946 164.5824 180.1811 187.7852 201.4851 213.1243 226.0188 242.3354 259.0143 279.4832 288.0036 314.7147 319.4646 323.4724 325.7356 334.9476 339.3621 361.2017 364.2681 366.1455 406.0414 408.8611 430.9491 439.3345 472.3432 491.8867 510.9033 529.5975 545.9488 559.7104 562.3016 575.7284 581.1968 596.7200 608.9567 618.1814 634.1468 656.3415 677.6549 681.8962 700.5540 707.2890 715.6327 744.2645 758.6150 789.6177 812.5684 826.9962 829.6191 839.7776 847.9002 869.4659 896.6887 925.1805 930.1309 945.2064 954.9887 961.1130 968.4740 969.7619 980.0527 988.1542 1021.3034 1052.5547 1068.7897 1071.2447 1079.7225 1098.3672 1101.6451 1115.0927 1151.7748 1165.2959 1167.4456 1180.0375 1192.6806 1195.0059 1228.8012 1233.2877 1264.4621 1278.3314 1283.8114 1287.7999 1295.1412 1305.5549 1322.4282 1345.4030 1350.2451 1354.7651 1364.9330 1366.1659 1379.0521 1385.1103 1393.0718 1416.9656 1456.4255 1470.2313 1476.5927 1514.8828 1526.5693 1574.9324 1583.2911 1584.9281 1639.5103 2635.1540 3015.2935 3018.7279 3042.2419 3068.5960 3075.5065 3118.8305 3158.9789 3161.8625 3168.8329 3178.3668 3182.0820 3532.6302 3564.0951 3685.7574
redmass: 12.1666 3.9177 11.6310 9.4340 6.2284 9.9212 7.2124 9.2315 9.1692 8.0777 6.5880 7.4291 6.8053 6.7469 4.6479 12.1727 6.4997 7.3923 6.1135 7.9942 8.5054 5.4133 5.1471 5.0595 3.5207 2.3430 4.1772 5.4371 11.2747 7.8972 5.3500 6.1305 2.8935 6.1128 4.6827 6.2480 4.2319 5.8954 8.8352 7.9618 2.3049 1.3257 1.2809 7.7518 8.2966 7.5428 7.1577 9.8421 7.8478 10.5805 5.9559 4.0880 6.3358 7.3028 13.0324 6.5565 8.0430 7.8633 1.2497 1.4557 1.5574 1.9393 4.3753 6.6517 8.7554 1.4274 4.4887 1.3361 3.2562 1.3734 2.4673 2.9836 5.9383 3.4148 4.7226 7.3600 1.8768 2.4944 9.6564 1.3575 2.7273 1.7261 3.4714 2.4763 1.1237 2.0644 1.8083 1.5903 2.3863 1.4106 5.5030 1.2343 1.4792 1.3912 1.6830 1.6981 1.4842 1.6727 2.5259 4.7512 1.5962 4.1155 1.8749 1.6906 4.5705 2.2133 3.0156 1.0886 3.5657 1.3458 6.1888 7.8762 1.7811 3.0424 1.0869 1.0650 1.0868 1.0842 1.0864 1.0796 1.1028 1.0895 1.0892 1.0934 1.0971 1.0983 1.0446 1.0663 1.1057
irintensity: 0.6438 0.0865 0.4920 0.3697 0.2544 6.1822 1.1118 0.7872 0.0317 1.2673 4.0334 11.6735 2.2911 7.8147 2.5302 2.6775 10.1249 7.4240 8.1577 11.8972 0.8456 5.7288 11.1963 2.5748 12.5955 37.0150 47.8460 59.7612 11.4452 1.1819 47.5663 6.5168 0.0888 2.4739 11.4752 28.1822 25.3004 11.1432 14.7739 11.9710 1.5361 190.2545 45.5654 13.2124 46.1303 27.1083 0.0334 105.3152 30.9095 0.9207 14.3345 0.2415 1.3740 7.4547 139.1624 31.2599 6.5871 176.6377 2.8152 67.2696 55.4959 83.3726 7.0574 18.9603 96.9756 7.9081 78.1958 0.1576 8.2886 0.2858 36.3728 111.1402 72.7762 10.0256 65.8706 37.9599 23.9772 4.8731 259.2993 8.2266 15.2510 49.9997 23.1182 16.2381 6.3075 35.1944 13.3049 31.4751 112.4159 16.8642 70.5325 0.8537 19.3667 22.8912 19.2664 75.0984 54.2381 14.8295 17.4975 0.6708 37.4341 11.7109 5.9741 19.9846 116.8946 76.7573 15.1381 6.7223 125.3374 27.2736 26.0284 1.8723 21.9479 624.8335 2405.1201 16.5287 38.4054 50.4824 6.0412 34.2355 11.1119 0.5706 0.8595 1.7922 2.1682 0.5445 140.7814 29.6466 59.1640
temp: 298.150 k
press: 1.00000 atm
elementType: 17 16 15 8 8 8 8 8 8 7 7 7 7 7 6 6 6 6 6 6 6 6 6 6 6 6 6 6 6 6 1 1 1 1 1 1 1 1 1 1 1 1 1 1 1
symmnumber: 1
zpe: 819945.7 jmol-1
zpe.correction: 0.312301 hartree
zpe.thermalcorrener: 0.339182 hartree
zpe.thermalcorrenthalpy: 0.340126 hartree
zpe.thermalcorrgfe: 0.252372 hartree
zpe.sumelectzpe: -2540.935302 hartree
zpe.sumelectthermal: -2540.908421 hartree
zpe.sumelectthermalent: -2540.907477 hartree
zpe.sumelectthermalfe: -2540.995230 hartree
dipole: -10.3007 0.6209 -0.4911
dipole: 10.3311
quadrupole: -260.8638 -188.8525 -186.9470
quadrupole: -15.2878 5.6741 -0.7273
quadrupole: -48.6427 23.3686 25.2741 -15.2878 5.6741 -0.7273
hfenergy: -2541.2476024 hartree
pointgroup: C01 [X(C16H15Cl1N5O6P1S1)]
dipole: -4.0622487 0.0438092 -0.1295449 debye
polarizability: 419.2676383|-4.8954547|255.198876|-6.0500641|-14.4237889|186.7118368 unknown
InChI: InChI=1S/C16H15ClN5O6PS/c17-7-1-3-8(4-2-7)30-16-21-10-13(18)19-6-20-14(10)22(16)15-11(23)12-9(27-15)5-26-29(24,25)28-12/h1-4,6,9,11-12,15,23-24H,5,18H2
charge 0 multiplicity 1
45 atoms
Cl -8.139733 0.002262 0.965979
S  -2.134183 -1.996827 -0.307259
P  5.423061 0.328908 -0.098687
O  1.597267 -1.17365 1.498343
O  4.55835 -1.122672 -0.730425
O  5.157885 0.085834 1.621305
O  2.348322 -3.333988 -0.568007
O  4.418719 1.633701 -0.536945
O  6.933467 0.42027 -0.511471
N  0.1574 -0.339798 -0.263745
N  -1.82859 0.772572 -0.662349
N  1.688064 1.715783 -0.437585
N  0.418634 3.774341 -0.863885
N  -1.931486 3.768132 -1.09866
C  3.196317 -0.999453 -0.218735
C  3.074639 -1.186063 1.30814
C  2.110524 -1.912648 -0.77555
C  0.967616 -1.498165 0.198619
C  3.738046 -0.026937 2.070069
C  0.488553 1.034986 -0.439493
C  -1.257628 -0.407769 -0.408469
C  -0.758432 1.676697 -0.670233
C  -0.772664 3.085479 -0.880604
C  1.555435 3.070033 -0.653192
C  -3.839204 -1.378378 0.056242
C  -4.74649 -1.19224 -1.00783
C  -4.227352 -1.156457 1.395059
C  -6.067715 -0.771956 -0.732837
C  -5.544851 -0.730819 1.677621
C  -6.442071 -0.545406 0.606582
H  2.810307 0.004069 -0.44962
H  3.483989 -2.162317 1.624757
H  1.855909 -1.690088 -1.829142
H  0.274479 -2.340881 0.354146
H  3.19312 0.919596 1.891718
H  3.813785 -0.215962 3.150737
H  3.231251 -3.567677 -0.95369
H  3.382547 1.574856 -0.460294
H  2.488544 3.641114 -0.659095
H  -2.819196 3.26845 -1.111484
H  -1.894517 4.775476 -1.244694
H  -4.430218 -1.366595 -2.040078
H  -3.515126 -1.310024 2.211171
H  -6.785306 -0.623277 -1.544392
H  -5.863167 -0.551312 2.708162
