program: Gaussian 09
title: 000091475
version: EM64L-G09RevD.01
frameworkgroup: C1[X(C21H34O3)]
method: RPBEPBE
basis: SDD
operation: Freq
keyword: #pfreq=noraman
keyword: PBEPBE/SDD
title: #p freq=noraman PBEPBE/SDD
converged: YES YES NO NO
title: Mulliken charges:
elementType: O O O C C C C C C C C C C C C C C C C C C C C C H H H H H H H H H H H H H H H H H H H H H H H H H H H H H H H H H H
charge: -0.433586 -0.242272 -0.445566 -0.134269 -0.099055 -0.113469 0.384478 0.360087 -0.058269 -0.540225 -0.535008 -0.512448 -0.231294 -0.556360 -0.489136 -0.498608 -0.474475 -0.529582 -0.823471 -0.817152 -0.453979 -0.082158 0.085984 -0.384415 0.229035 0.189541 0.205647 0.191364 0.227556 0.209722 0.197717 0.209748 0.218920 0.209214 0.237182 0.213210 0.237437 0.199210 0.212475 0.206508 0.200454 0.261284 0.213140 0.201628 0.218694 0.227172 0.229202 0.248041 0.219275 0.215468 0.222398 0.219642 0.190773 0.216621 0.239387 0.223964 0.317332 0.365288
chargesum: 0.00000
title: Mulliken charges with hydrogens summed into heavy atoms:
elementType: O O O C C C C C C C C C C C C C C C C C C C C C
charge: -0.116254 -0.242272 -0.080278 0.094766 0.090486 0.092178 0.384478 0.360087 0.133094 -0.102947 -0.127543 -0.084313 0.005888 -0.105714 -0.077451 -0.091647 -0.000051 -0.109260 -0.119056 -0.160010 -0.043564 0.134463 0.085984 0.078936
polarizability: 2.67838005e+02 2.31808133e+00 2.11271312e+02 -1.62287135e+00 -5.13762733e-01 1.93075593e+02
1716.lowfreq: -14.5242 -2.1032 -0.0009 -0.0008 0.0002 10.5052 28.6111 40.0850 50.0680
frequency: 27.9624 39.8420 50.0489 66.2950 77.1144 107.5713 126.7014 147.2260 158.7024 183.1862 185.7305 203.3554 209.2549 223.1126 229.9797 262.1467 266.8560 269.2311 291.6306 292.3378 306.1909 314.2092 321.7329 339.7879 356.4229 367.2432 380.9603 410.2432 411.0669 422.5100 449.5090 452.8223 460.0914 464.6413 496.4272 497.3002 523.3838 550.5682 586.0083 606.0849 611.2202 646.2345 680.4225 725.9596 738.7661 781.0554 806.3264 819.0543 828.1120 836.7292 844.0839 890.5560 899.1349 902.4220 906.3121 918.6761 928.2726 937.7365 947.0571 956.3932 976.9468 983.0489 997.0240 1001.8926 1008.4835 1017.1152 1022.6064 1026.4058 1035.0539 1041.4674 1048.7910 1067.4301 1075.5504 1088.9487 1093.9690 1104.6888 1117.0651 1117.9835 1126.0273 1130.1148 1143.8660 1156.9670 1166.1930 1172.6538 1178.3115 1187.8600 1194.2427 1204.2273 1210.9239 1218.5784 1229.8109 1239.6313 1249.2998 1250.4740 1253.7275 1268.5893 1271.9563 1278.9753 1289.4419 1293.9426 1296.3383 1306.5461 1316.7261 1320.2720 1322.1527 1326.1578 1327.2672 1334.8513 1338.9069 1345.3593 1346.0689 1348.4477 1350.9251 1353.9756 1367.3372 1372.0803 1387.6194 1392.9760 1403.9571 1443.5379 1457.5472 1460.0188 1465.3956 1466.8782 1470.9795 1473.9359 1475.5384 1476.2025 1478.4145 1481.9502 1488.4287 1492.2654 1493.2903 1602.7431 2903.7181 2925.7967 2936.4773 2939.5314 2946.3561 2957.4375 2960.0746 2965.2198 2967.4370 2971.4137 2972.5767 2976.0250 2978.8579 2989.4151 2991.2380 2993.0099 2995.9517 3010.4173 3015.9762 3017.0355 3019.7179 3030.8753 3032.7635 3036.1677 3045.1080 3049.6294 3053.5054 3060.8726 3077.7069 3081.2706 3084.0017 3095.8355 3402.9201 3540.3081
redmass: 5.4506 4.6320 5.5505 3.9136 4.2047 2.4834 2.7816 2.6340 1.9173 2.2229 3.1953 1.5355 1.6703 3.0883 2.1044 2.4242 1.5465 2.4432 2.4727 2.5976 2.8181 2.0885 3.5192 2.7248 2.3853 3.4600 2.9767 2.3285 2.5719 2.2684 2.5134 2.1836 2.1040 2.8690 2.2186 2.5809 2.5625 2.8474 2.7212 3.0384 2.3634 2.8914 2.7877 2.8829 2.7217 2.1347 2.0221 2.1429 1.6933 2.3447 2.1482 2.1256 1.9594 2.6850 1.9495 1.9222 2.2955 2.0670 2.0480 1.7920 1.8887 2.6079 2.2785 2.9257 2.6728 2.0250 1.9069 1.7870 2.3132 1.9911 2.4044 1.9230 2.8462 2.2474 1.5380 1.2631 2.3693 2.1082 1.9995 2.2208 1.5515 1.6745 1.9943 1.8994 1.1755 1.8583 1.8636 1.6279 1.3566 1.5020 1.6156 1.3382 1.4033 1.3778 1.4528 1.4368 1.4867 1.3459 1.4235 1.3862 1.3061 1.3760 1.3623 1.4365 1.3404 1.3653 1.4306 1.4457 1.4481 1.4807 1.5324 1.4336 1.4521 1.4389 1.4941 1.2191 1.4184 1.2030 1.1952 1.0776 1.0795 1.0867 1.0760 1.0776 1.0765 1.0734 1.0862 1.0899 1.0760 1.0622 1.0617 1.0755 1.0677 7.0200 1.0812 1.0796 1.0813 1.0641 1.0611 1.0682 1.0684 1.0618 1.0734 1.0751 1.0691 1.0572 1.0482 1.0640 1.0918 1.0446 1.0588 1.0935 1.0640 1.0886 1.0935 1.1008 1.0954 1.0968 1.1000 1.0979 1.1006 1.0977 1.0984 1.1026 1.0968 1.0988 1.0639 1.0658
irintensity: 1.2293 1.1167 0.8665 0.7981 2.5238 5.3176 1.5569 2.3156 2.2867 0.8298 0.2975 0.9599 1.6427 0.9929 0.4573 5.2141 29.1131 1.3937 6.2763 8.4879 1.8474 44.6806 24.1665 20.4143 3.8942 11.9060 2.4893 12.1652 17.2518 22.9651 5.2470 6.4103 31.3754 12.9751 17.1520 1.5853 0.7857 3.7564 3.0146 8.6692 0.7819 0.4740 4.6620 0.3710 0.9084 0.5785 0.8514 1.8151 3.7180 5.6814 16.9761 14.8488 12.7919 19.7112 10.7108 0.5682 7.2622 3.8905 6.7173 1.5436 4.3108 65.9708 8.0188 59.2821 25.6154 3.7193 23.1462 18.4502 43.6552 4.3702 17.1686 11.2817 10.2284 13.7876 2.6815 1.4465 6.0517 17.5755 15.0290 4.1080 11.2128 0.4253 2.4295 10.5933 4.6309 6.2435 12.5082 7.3080 3.3814 8.6585 14.0459 4.9867 26.4430 80.8158 14.6147 1.7780 5.8341 10.4239 3.7290 12.0656 2.3767 0.4910 0.0891 3.2082 0.3946 6.4012 0.5128 16.8499 10.9614 14.9794 18.9644 2.1713 10.7152 2.1020 25.1973 44.2531 52.2906 14.3893 31.1799 12.1082 1.7629 3.3883 16.2678 8.6243 22.6874 14.9129 0.7394 4.6328 5.0547 8.3855 7.5353 8.2372 6.7360 81.3315 10.7860 14.7938 22.8772 32.9200 35.4088 6.6539 18.8413 19.7595 1.7085 20.5381 84.5171 49.5300 51.5059 36.2920 13.9792 16.8112 28.0132 57.7419 24.5047 10.3787 37.3605 47.9036 51.5546 48.7222 53.2337 78.8024 19.9802 59.3018 24.1618 36.5373 39.8079 22.8857 27.4757 6.7775
temp: 298.150 k
press: 1.00000 atm
elementType: 8 8 8 6 6 6 6 6 6 6 6 6 6 6 6 6 6 6 6 6 6 6 6 6 1 1 1 1 1 1 1 1 1 1 1 1 1 1 1 1 1 1 1 1 1 1 1 1 1 1 1 1 1 1 1 1 1 1
symmnumber: 1
zpe: 1346337.4 jmol-1
zpe.correction: 0.512793 hartree
zpe.thermalcorrener: 0.536406 hartree
zpe.thermalcorrenthalpy: 0.537350 hartree
zpe.thermalcorrgfe: 0.461652 hartree
zpe.sumelectzpe: -1044.399033 hartree
zpe.sumelectthermal: -1044.375421 hartree
zpe.sumelectthermalent: -1044.374477 hartree
zpe.sumelectthermalfe: -1044.450174 hartree
dipole: 2.0567 1.5806 -0.3866
dipole: 2.6226
quadrupole: -196.4583 -153.5308 -144.5221
quadrupole: -2.7913 14.4208 -1.1626
quadrupole: -31.6213 11.3063 20.3150 -2.7913 14.4208 -1.1626
hfenergy: -1044.9118263 hartree
pointgroup: C01 [X(C21H34O3)]
dipole: -0.7957516 -0.6492447 -0.0993678 debye
polarizability: 267.7069831|3.6177591|211.3492951|1.5814605|-1.0224951|193.1286314 unknown
InChI: InChI=1S/C21H34O3/c1-20-9-7-14(23)11-13(20)3-4-15-16-5-6-18(19(24)12-22)21(16,2)10-8-17(15)20/h13-18,22-23H,3-12H2,1-2H3
charge 0 multiplicity 1
58 atoms
O  -5.147956 1.19087 -2.356297
O  5.230612 -0.175427 0.393947
O  5.936467 2.330383 -0.221482
C  -0.438706 -1.148234 0.367284
C  -1.126667 0.260757 0.36232
C  0.892067 -1.052618 -0.40758
C  1.884864 0.000852 0.185772
C  -2.520225 0.244727 1.101557
C  -3.438401 -0.866231 0.465062
C  -0.161319 1.371703 0.867883
C  1.203209 1.388118 0.124195
C  -1.371231 -2.226271 -0.236777
C  3.096901 -0.214127 -0.820251
C  1.757125 -2.321705 -0.594235
C  -2.749747 -2.256208 0.460197
C  -3.265982 1.613983 0.982056
C  3.162804 -1.767946 -1.006924
C  -3.947202 -0.494606 -0.958267
C  2.332094 -0.327826 1.634535
C  -2.348649 -0.036194 2.621775
C  -3.728008 1.976688 -0.447962
C  -4.650347 0.874638 -1.00063
C  4.399491 0.406479 -0.364879
C  4.730964 1.825298 -0.838134
H  -0.217824 -1.442231 1.414835
H  -1.327178 0.487751 -0.709409
H  0.633991 -0.684467 -1.428873
H  -4.339976 -0.935356 1.114201
H  0.019046 1.251887 1.953061
H  -0.634387 2.363545 0.740087
H  1.034455 1.665509 -0.9386
H  1.846485 2.174298 0.568215
H  -0.891877 -3.220845 -0.154408
H  -1.496888 -2.030693 -1.322155
H  2.799012 0.272157 -1.772662
H  1.3417 -3.002291 -1.35784
H  1.819718 -2.893766 0.350843
H  -3.410823 -2.991429 -0.040754
H  -2.62091 -2.611244 1.501726
H  -2.641447 2.426327 1.398671
H  -4.165999 1.561771 1.631243
H  3.966624 -2.183147 -0.375116
H  3.408235 -2.016664 -2.054691
H  -3.107008 -0.478442 -1.682969
H  -4.65134 -1.27391 -1.30802
H  2.974886 0.477636 2.034142
H  1.4691 -0.429147 2.31346
H  2.916795 -1.261492 1.687903
H  -1.855223 0.810767 3.132891
H  -3.339255 -0.172541 3.096226
H  -1.754867 -0.942781 2.828523
H  -4.267579 2.942184 -0.445644
H  -2.854517 2.096124 -1.123575
H  -5.578622 0.838704 -0.400064
H  3.879413 2.499316 -0.611231
H  4.84268 1.797555 -1.94505
H  -4.368493 1.239328 -2.967896
H  6.317015 1.572286 0.309961
