program: Gaussian 09
title: 000091333
version: EM64L-G09RevD.01
frameworkgroup: C1[X(C5H11NO3)]
method: RPBEPBE
basis: SDD
operation: Freq
keyword: #p
keyword: freq=noraman
keyword: PBEPBE/SDD
title: #p freq=noraman PBEPBE/SDD
converged: YES YES NO NO
title: Mulliken charges:
elementType: O O O N C C C C C H H H H H H H H H H H
charge: -0.453101 -0.447881 -0.314988 -0.055866 -0.408549 -0.386120 -0.274564 -0.302541 -0.012761 0.246399 0.220298 0.259762 0.195256 0.204677 0.205129 0.208178 0.185089 0.204711 0.357697 0.369177
chargesum: 0.00000
title: Mulliken charges with hydrogens summed into heavy atoms:
elementType: O O O N C C C C C
charge: -0.095404 -0.078704 -0.314988 -0.055866 0.058147 0.068898 0.135242 0.090727 0.191950
polarizability: 8.30079011e+01 3.87524676e+00 7.46307054e+01 -3.03231511e+00 -7.72759846e-01 5.58504885e+01
1716.lowfreq: -10.0468 -0.0012 -0.0008 -0.0002 8.4827 15.8482 38.4760 57.5699 97.1181
frequency: 37.9833 57.3516 97.1114 158.6602 185.6855 237.4081 242.8361 267.7888 310.3400 386.7288 400.8241 464.8015 518.0925 620.0206 745.8441 783.8042 842.0113 864.0540 945.0963 952.1264 989.5180 1019.4830 1033.6145 1050.0191 1060.5556 1153.2730 1169.9602 1203.9128 1218.9850 1257.1828 1280.0353 1330.3145 1350.2472 1359.7601 1385.8836 1390.5384 1401.1861 1444.6670 1447.8624 1458.9676 1465.4542 1473.2687 1608.3026 2936.8250 2948.4688 2985.8875 3000.4492 3015.1727 3018.8155 3045.9807 3058.4578 3075.4316 3258.4784 3589.3476
redmass: 5.5533 3.4018 4.9440 2.6602 2.5064 1.3770 3.1520 4.2400 3.3483 2.4558 2.3547 2.0341 3.3693 3.2456 1.4073 1.7373 2.6566 2.7603 2.1140 1.6296 2.3656 3.3308 2.4370 2.1615 2.5791 1.8694 1.3542 1.0735 1.1868 1.5182 1.2705 1.3383 1.2429 1.2836 1.3713 1.5469 1.5933 1.2217 1.1155 1.1195 1.0941 1.0953 4.8412 1.0687 1.0554 1.0607 1.0922 1.0816 1.0815 1.0974 1.0991 1.1032 1.0667 1.0669
irintensity: 2.2745 0.3038 4.0244 18.7961 7.8698 103.7495 36.8467 23.1881 24.1252 0.5749 2.0082 3.7465 24.6016 12.3892 105.8425 76.0867 5.4119 20.3707 7.3016 2.3441 11.5359 56.7346 60.7268 27.0177 33.4075 14.4763 55.6752 20.2668 9.3784 3.4635 33.6448 19.0038 10.2487 13.9441 16.9926 19.7889 34.6154 140.0996 44.3584 11.1271 7.5341 4.0690 292.0589 71.6033 60.1802 28.1048 26.2537 31.1606 95.7379 45.2324 34.0159 24.7950 251.0630 7.9225
temp: 298.150 k
press: 1.00000 atm
elementType: 8 8 8 7 6 6 6 6 6 1 1 1 1 1 1 1 1 1 1 1
symmnumber: 1
zpe: 434273.6 jmol-1
zpe.correction: 0.165406 hartree
zpe.thermalcorrener: 0.175725 hartree
zpe.thermalcorrenthalpy: 0.176670 hartree
zpe.thermalcorrgfe: 0.128918 hartree
zpe.sumelectzpe: -476.787439 hartree
zpe.sumelectthermal: -476.777119 hartree
zpe.sumelectthermalent: -476.776175 hartree
zpe.sumelectthermalfe: -476.823927 hartree
dipole: -6.3507 -4.2294 0.3199
dipole: 7.6369
quadrupole: -62.7161 -55.5501 -50.7890
quadrupole: -0.9522 6.5277 -0.0846
quadrupole: -6.3644 0.8016 5.5628 -0.9522 6.5277 -0.0846
hfenergy: -476.9528448 hartree
pointgroup: C01 [X(C5H11N1O3)]
dipole: -2.4696905 -1.7111733 0.0051678 debye
dipolederiv: -0.5719518 0.1397185 0.1586471 0.2013215 -0.6920435 0.1401743 0.1587025 0.0814384 -0.2954043 -0.7379835 -0.0764032 -0.0282293 -0.0504004 -0.6499252 0.0532773 -0.0200613 0.064749 -0.530721 -1.011496 -0.4628302 0.0702539 -0.2661624 -0.878032 -0.0669535 0.2565578 0.1282694 -0.4134089 -0.6269429 -0.056218 0.0014639 -0.3698021 -1.0084934 -0.1175676 -0.0486492 -0.0964446 -0.3619682 0.5302975 0.1928253 -0.0420256 0.2086765 0.2614969 -0.0678749 -0.0764635 -0.1182357 0.1744516 0.1039069 -0.1714474 -0.0841449 -0.1607851 0.2463353 0.0954618 -0.1659484 0.0871495 0.2989857 0.3067804 -0.1667484 -0.0651638 -0.1737056 0.5766885 -0.0761079 -0.0892565 -0.0589219 0.2544636 0.4086495 0.0954973 -0.0169537 0.1090201 0.4895053 -0.130194 0.031321 -0.0707382 0.3471176 0.8521463 0.5341048 -0.14401 0.6623611 1.3934648 0.1793899 -0.1345233 0.1049389 0.2768173 0.0041658 -0.0217908 0.03968 0.0121668 0.0755345 -0.1205639 0.0617681 -0.0337703 -0.0585721 0.0080071 0.0427209 -0.0261934 -0.0072599 -0.1383279 0.059135 -0.0172309 0.0084543 0.1053937 0.0403893 0.0533701 -0.0045805 0.0475695 0.0276034 0.0850091 -0.0039157 -0.0124915 -0.104569 -0.0104154 -0.1110874 -0.0000296 -0.0890343 -0.1150006 -0.0338517 0.0219176 0.0022897 0.0841015 -0.1527258 -0.1480242 0.046824 -0.0845143 -0.1207184 0.0456687 0.0474062 0.0575324 0.0470913 0.0543371 0.0689 0.0817606 0.0612723 -0.0419693 -0.0381207 0.0607228 -0.0827889 -0.1478923 0.0077104 0.0778315 0.0477736 0.0702943 -0.106176 -0.0613166 0.0532262 -0.1193635 0.0319141 0.0134412 -0.048473 0.0219779 -0.0337611 0.0041631 0.0568957 -0.0306819 0.1136891 -0.2268263 -0.082129 0.0570272 0.1475534 0.0163591 0.070829 -0.0202866 0.1470843 -0.0666583 0.0112477 0.2581907 0.022263 -0.1694409 -0.0119108 0.2854798 -0.0250235 -0.1912329 0.0030824 0.1622171 0.605622 -0.0212362 -0.0351627 -0.1417052 0.3195856 0.0428491 -0.0607429 0.0078198 0.3455609 unknown
polarizability: 82.2212205|4.8260397|74.3901035|-4.5082329|2.4922968|56.8777711 unknown
InChI: InChI=1S/C5H11NO3/c7-3-1-6(5-9)2-4-8/h5,7-8H,1-4H2
charge 0 multiplicity 1
20 atoms
O  -2.877735 0.631352 -0.186905
O  3.04709 0.13033 -0.759617
O  1.139828 1.737646 0.274294
N  -0.085231 -0.266887 0.31137
C  -1.326618 -0.932631 0.756784
C  0.794264 -0.972179 -0.665831
C  -2.491033 -0.7840 -0.234806
C  2.300068 -1.02089 -0.287414
C  0.136303 1.049242 0.647178
H  -1.646557 -0.496912 1.720538
H  -1.119486 -2.00486 0.927879
H  0.718273 -0.488843 -1.660374
H  0.398725 -2.000795 -0.752838
H  -3.329864 -1.436182 0.089473
H  -2.174407 -1.089631 -1.25402
H  2.756705 -1.892754 -0.789762
H  2.392245 -1.165306 0.812488
H  -0.651898 1.478474 1.295344
H  -3.472439 0.854676 -0.944533
H  2.542465 0.943951 -0.444749
