program: Gaussian 09
title: 000009622
version: EM64L-G09RevD.01
frameworkgroup: C1[X(CClFO)]
method: RPBEPBE
basis: SDD
operation: Freq
keyword: #p
keyword: freq=noraman
keyword: PBEPBE/SDD
title: #p freq=noraman PBEPBE/SDD
converged: NO NO NO NO
title: Mulliken charges:
elementType: Cl F O C
charge: 0.061131 -0.133291 -0.082230 0.154390
chargesum: 0.00000
title: Mulliken charges with hydrogens summed into heavy atoms:
polarizability: 3.52320697e+01 -3.14247062e+00 2.09918066e+01 6.22308092e-04 -4.99442081e-04 9.78443990e+00
1716.lowfreq: 0.0032 0.0033 0.0041 10.1823 16.6330 25.4545 363.9582 435.4068 587.1174
frequency: 363.9581 435.4067 587.1173 656.1862 936.6848 1773.4240
redmass: 19.2162 21.4941 12.7553 15.9708 13.6774 13.2876
irintensity: 1.9552 1.7705 12.5654 79.8209 380.6286 361.5948
temp: 298.150 k
press: 1.00000 atm
elementType: 17 9 8 6
symmnumber: 1
zpe: 28427.9 jmol-1
zpe.correction: 0.010828 hartree
zpe.thermalcorrener: 0.014630 hartree
zpe.thermalcorrenthalpy: 0.015574 hartree
zpe.thermalcorrgfe: -0.016294 hartree
zpe.sumelectzpe: -672.910667 hartree
zpe.sumelectthermal: -672.906865 hartree
zpe.sumelectthermalent: -672.905921 hartree
zpe.sumelectthermalfe: -672.937789 hartree
dipole: -0.9076 0.3510 0.0000
dipole: 0.9731
quadrupole: -29.4411 -31.1011 -27.0593
quadrupole: 0.8032 -0.0001 0.0002
quadrupole: -0.2406 -1.9006 2.1412 0.8032 -0.0001 0.0002
hfenergy: -672.9214951 hartree
pointgroup: C01 [X(C1Cl1F1O1)]
dipole: -0.3612099 0.1268979 -0.0000067 debye
dipolederiv: -0.8299667 -0.0040178 -0.0000158 0.0536516 -0.1076722 0.000005 -0.000023 0.0000042 -0.0093273 -0.5555329 -0.2370475 0.0000009 -0.395663 -0.9294045 0.0000251 0.0000115 0.0000345 -0.1128657 -0.8057296 0.2785601 -0.0000249 0.3350303 -0.7507411 0.0000312 -0.0000196 0.0000229 -0.218719 2.1912292 -0.0374949 0.0000398 0.006981 1.7878178 -0.0000614 0.0000311 -0.0000616 0.340912 unknown
polarizability: 35.4141571|-2.6923954|20.8097192|0.0006376|-0.0004798|9.7844399 unknown
InChI: InChI=1S/CClFO/c2-1(3)4
charge 0 multiplicity 1
4 atoms
Cl -1.657693 -0.035974 -0.000032
F  0.640482 1.220731 -0.000039
O  0.859468 -1.087178 0.000058
C  0.157843 -0.097479 0.000013
