program: Gaussian 09
title: 000091241
version: EM64L-G09RevD.01
frameworkgroup: C1[X(C6H8Cl2O2)]
method: RPBEPBE
basis: SDD
operation: Freq
keyword: #p
keyword: freq=noraman
keyword: PBEPBE/SDD
title: #p freq=noraman PBEPBE/SDD
converged: YES YES NO NO
title: Mulliken charges:
elementType: Cl Cl O O C C C C C C H H H H H H H H
charge: -0.028524 -0.035575 -0.269735 -0.241690 -0.346117 -0.200802 -0.563486 0.261924 -0.209419 -0.468444 0.290883 0.277928 0.232682 0.298167 0.267381 0.254975 0.231493 0.248358
chargesum: 0.00000
title: Mulliken charges with hydrogens summed into heavy atoms:
elementType: Cl Cl O O C C C C C C
charge: -0.028524 -0.035575 -0.269735 -0.241690 -0.055234 0.309808 0.002063 0.261924 0.045557 0.011407
polarizability: 1.20446583e+02 -1.59905498e+00 8.31059997e+01 2.74189783e+00 4.23844716e+00 6.49335152e+01
1716.lowfreq: -8.1213 -1.1730 -0.0029 -0.0026 -0.0002 6.7713 26.0531 41.5567 60.9312
frequency: 25.8763 41.4966 60.9307 97.9743 108.9563 156.5963 194.9891 231.0772 266.2261 315.8923 383.1833 441.9672 505.6408 547.8871 575.7039 654.1312 676.3651 779.0892 843.6568 876.9872 955.2783 975.2641 997.9916 1004.8140 1013.1678 1064.3537 1107.6240 1127.0835 1169.1321 1198.9963 1231.1910 1269.6856 1288.0603 1305.2307 1371.8651 1411.8808 1436.6565 1451.7889 1630.2125 1641.2862 2999.7053 3044.8547 3056.9444 3093.7402 3105.3168 3142.3940 3161.5968 3221.5426
redmass: 6.5698 5.7976 9.4476 7.1641 3.2217 7.8448 4.4923 3.0441 3.6715 2.8937 3.3667 5.2039 1.7662 5.1109 5.4528 3.8432 4.4033 3.3813 4.5123 1.6971 2.1599 2.7750 1.4093 1.0772 2.6092 1.6223 1.5826 4.2997 1.1623 1.2068 1.4496 1.2474 1.4007 1.2572 1.5414 1.2244 1.0945 1.0751 11.8018 4.4942 1.0634 1.0671 1.0782 1.0994 1.0601 1.1070 1.0958 1.1158
irintensity: 1.7076 1.5886 0.3942 2.7530 2.8279 2.7867 2.1543 4.3557 7.5706 5.3342 16.0237 7.2534 0.1063 19.1701 17.5139 3.4958 14.8845 24.6948 18.6832 4.6219 18.3921 29.6940 30.8438 52.0205 13.7044 24.7148 10.4405 452.2212 1.4520 6.2984 6.1303 16.3557 35.8301 8.8319 3.7961 80.2384 13.3411 9.5641 141.8949 23.4843 16.8526 3.7638 15.0163 6.7121 3.8628 4.2040 3.0637 7.0641
temp: 298.150 k
press: 1.00000 atm
elementType: 17 17 8 8 6 6 6 6 6 6 1 1 1 1 1 1 1 1
symmnumber: 1
zpe: 342504.5 jmol-1
zpe.correction: 0.130453 hartree
zpe.thermalcorrener: 0.141906 hartree
zpe.thermalcorrenthalpy: 0.142850 hartree
zpe.thermalcorrgfe: 0.090165 hartree
zpe.sumelectzpe: -1303.205459 hartree
zpe.sumelectthermal: -1303.194006 hartree
zpe.sumelectthermalent: -1303.193062 hartree
zpe.sumelectthermalfe: -1303.245747 hartree
dipole: -1.0530 1.0210 3.3734
dipole: 3.6785
quadrupole: -63.8308 -79.4306 -70.0453
quadrupole: -3.9812 5.4868 -0.2716
quadrupole: 7.2714 -8.3284 1.0570 -3.9812 5.4868 -0.2716
hfenergy: -1303.3359125 hartree
pointgroup: C01 [X(C6H8Cl2O2)]
dipole: -0.3508969 -0.5206128 -1.3039595 debye
dipolederiv: -0.24264 0.0544025 -0.0133632 0.063968 -0.3962697 0.179045 -0.004243 0.2413718 -0.3210109 -0.2852013 -0.0884235 -0.0384653 -0.1358555 -0.307813 -0.1171431 -0.104214 -0.1691311 -0.2614253 -1.7074848 0.2211755 0.1624952 0.2569397 -0.4680207 -0.0791003 0.2305489 -0.0972477 -0.3081803 -0.6901357 -0.0637715 0.000112 0.118671 -0.8604788 -0.1491849 0.0816159 -0.1461248 -0.3573269 0.1869648 -0.1051936 0.0265414 -0.1842961 0.4716409 -0.3222261 -0.0406414 -0.4524404 0.3901784 0.8247794 0.031498 0.0180524 0.2536791 0.0745364 -0.0200465 0.0112661 0.0170244 0.2027595 0.1911999 0.1840714 0.099043 0.2245581 0.3379837 0.2510189 0.1689063 0.3460145 0.3056887 1.9722513 -0.0886544 -0.1425812 -0.2460687 1.050401 0.2219455 -0.2735222 0.2388341 0.349822 -0.5606336 -0.1406579 -0.0099303 -0.0575524 0.0294666 0.065774 0.0274203 0.0641663 -0.1547313 0.0813582 0.0819694 -0.0188378 -0.0738573 0.0478744 0.0919192 -0.0649527 0.0815305 -0.2526631 0.0593984 -0.0579868 -0.049109 -0.0032977 -0.0070307 -0.0201427 0.0012436 0.0270927 -0.0541352 -0.0082406 -0.002561 0.0043299 -0.0629645 0.0868119 -0.0271942 -0.0114063 -0.0427779 -0.0084332 -0.0587259 0.0453166 -0.0164767 -0.0759078 -0.0190273 0.098014 0.0329547 0.0839377 -0.0014508 -0.0295767 0.0326781 -0.0018725 0.0497259 -0.0062281 -0.0820633 -0.0263382 -0.0718025 0.0584094 0.0854812 -0.050875 -0.0443497 -0.0496229 -0.020784 0.052748 -0.0471397 0.0221896 -0.0828715 0.0767858 0.0336503 0.0208754 -0.0155944 -0.0337294 -0.0579728 0.0060422 -0.0602976 0.1618925 -0.0191734 -0.0820566 -0.0039002 -0.0913012 0.0366548 -0.0273338 -0.0032628 -0.0280973 0.1648192 0.1235931 -0.0045815 0.0074365 0.0287767 -0.015988 -0.0580569 0.0157223 -0.0542422 0.1686589 unknown
polarizability: 120.3904862|2.8830198|83.8396497|-1.1966098|2.7526974|64.2559616 unknown
InChI: InChI=1S/C6H8Cl2O2/c1-2-6(9)10-4-5(8)3-7/h2,5H,1,3-4H2
charge 0 multiplicity 1
18 atoms
Cl 2.059685 -1.786697 0.884848
Cl 3.633738 1.388928 0.56216
O  -0.563394 -0.389842 -0.309385
O  -1.770475 1.49478 0.363256
C  1.832898 -0.529546 -0.514843
C  0.677208 0.406807 -0.184463
C  3.152806 0.177751 -0.795357
C  -1.751633 0.288791 0.019932
C  -2.908207 -0.631576 -0.111247
C  -4.173195 -0.206381 0.141589
H  1.57675 -1.155427 -1.388252
H  0.760437 0.827472 0.831047
H  0.64342 1.247427 -0.905729
H  3.984132 -0.536431 -0.870009
H  3.077845 0.783438 -1.713837
H  -2.682418 -1.658927 -0.414031
H  -5.03177 -0.879582 0.051289
H  -4.360228 0.829916 0.446733
