program: Gaussian 09
title: 000091232
version: EM64L-G09RevD.01
frameworkgroup: C1[X(C6H12Br2)]
method: RPBEPBE
basis: SDD
operation: Freq
keyword: #pfreq=noraman
keyword: PBEPBE/SDD
title: #p freq=noraman PBEPBE/SDD
converged: YES YES NO NO
title: Mulliken charges:
elementType: Br Br C C C C C C H H H H H H H H H H H H
charge: -0.056450 -0.056467 -0.329550 -0.329533 -0.435425 -0.435217 -0.647444 -0.647705 0.225423 0.241092 0.225703 0.240723 0.285882 0.285980 0.227740 0.248838 0.239809 0.248814 0.239761 0.228025
chargesum: 0.00000
title: Mulliken charges with hydrogens summed into heavy atoms:
elementType: Br Br C C C C C C
charge: -0.056450 -0.056467 0.136965 0.136894 -0.149543 -0.149237 0.068943 0.068895
polarizability: 1.46141813e+02 -1.85435715e+01 8.73965010e+01 -5.67094433e+00 3.38705737e+00 6.34764333e+01
1716.lowfreq: -9.1258 -4.4062 -0.0004 -0.0003 0.0003 12.0737 24.4253 60.8681 81.9137
frequency: 24.3348 60.8680 81.9134 128.8122 132.4995 230.0433 231.9319 258.4722 287.9634 289.3257 329.6757 405.2210 406.1530 572.4141 593.6297 773.4622 882.8839 888.1574 926.1716 985.3013 1009.1441 1014.0440 1022.3029 1120.1226 1135.6046 1147.1513 1164.2988 1208.2746 1230.2501 1280.1488 1284.5646 1337.0985 1337.3905 1341.9245 1393.8859 1395.0677 1454.7457 1463.0823 1465.0091 1470.6068 1479.3803 1480.0753 2981.7480 2982.2040 2992.9866 3000.9909 3047.7473 3053.4021 3062.1146 3077.2156 3078.2749 3081.9401 3108.6598 3109.1949
redmass: 3.9158 3.4162 5.1370 2.6368 5.8428 1.1669 1.4592 1.8870 3.1928 2.6901 3.8390 2.1895 2.2650 3.3068 3.5273 1.2297 2.6535 2.2968 1.2665 1.3515 3.4763 1.4168 1.4434 1.8127 2.0772 2.0831 1.3953 1.3484 1.3131 1.1812 1.2692 1.3695 1.3455 1.3755 1.2104 1.2222 1.0612 1.0475 1.0509 1.0581 1.0579 1.0819 1.0389 1.0386 1.0617 1.0605 1.0928 1.0879 1.0952 1.0955 1.0944 1.1007 1.1004 1.1004
irintensity: 2.2324 0.8557 2.9016 0.0000 0.0000 1.6844 0.0250 0.0014 0.0051 12.2502 16.4250 0.1235 5.2045 43.0452 0.0004 6.0212 0.0022 16.7395 0.0001 26.2617 0.0013 0.0005 33.3283 16.7600 0.0024 0.0004 88.0557 0.0004 11.2520 0.1153 83.5701 0.0012 0.0002 9.4074 0.0559 47.7371 0.0035 18.0734 0.0209 7.8172 0.1616 26.8660 0.4458 29.4155 0.0034 26.4479 0.0003 6.4295 0.0004 36.4635 0.0204 53.0364 0.0274 50.1551
temp: 298.150 k
press: 1.00000 atm
elementType: 35 35 6 6 6 6 6 6 1 1 1 1 1 1 1 1 1 1 1 1
symmnumber: 1
zpe: 438430.7 jmol-1
zpe.correction: 0.166989 hartree
zpe.thermalcorrener: 0.177962 hartree
zpe.thermalcorrenthalpy: 0.178906 hartree
zpe.thermalcorrgfe: 0.127118 hartree
zpe.sumelectzpe: -262.100282 hartree
zpe.sumelectthermal: -262.089310 hartree
zpe.sumelectthermalent: -262.088365 hartree
zpe.sumelectthermalfe: -262.140154 hartree
dipole: -0.0007 -0.0025 0.0112
dipole: 0.0115
quadrupole: -91.0069 -66.3657 -68.5538
quadrupole: 5.4825 0.6934 0.7465
quadrupole: -15.6981 8.9431 6.7550 5.4825 0.6934 0.7465
hfenergy: -262.2672714 hartree
pointgroup: C01 [X(C6H12Br2)]
dipole: 0.0004107 0.0009015 0.0044046 debye
dipolederiv: -0.6325463 0.2450787 -0.0107986 0.2808469 -0.4068933 0.0096708 -0.0617966 0.0500839 -0.1669122 -0.6327192 0.2450983 -0.0122885 0.2800988 -0.4062309 0.0113 -0.063729 0.0517036 -0.1672994 -0.2465313 0.0378485 0.030396 -0.0100299 -0.0095257 0.0358525 0.0453318 0.043668 0.1152562 -0.2463065 0.0378222 0.030683 -0.0096982 -0.0088832 0.0365953 0.0454033 0.0444341 0.1141788 0.8658988 -0.3841454 0.0585027 -0.3390202 0.5603377 -0.0418598 0.0235577 -0.0644887 0.1572142 0.8663985 -0.3840039 0.0606826 -0.338505 0.5591441 -0.0448908 0.0257615 -0.0672645 0.158092 -0.1374074 0.0820489 -0.0039109 -0.0339912 -0.2012958 -0.0472338 -0.0151561 0.0180245 0.0453065 -0.1374826 0.0819949 -0.0044091 -0.0340224 -0.2017721 -0.0454531 -0.0150234 0.0200291 0.0456293 0.0641702 0.0045795 -0.0099191 0.0005181 0.0778938 -0.0060184 0.0017506 0.0140385 -0.1291346 0.0838892 -0.0381472 -0.0154025 -0.0404626 -0.1114525 -0.0425073 -0.0092312 -0.0520278 0.0528752 0.0638291 0.0046041 -0.0102339 0.0003662 0.0779275 -0.0067101 0.0011866 0.0134623 -0.1288522 0.0843391 -0.0385935 -0.0149884 -0.0408807 -0.1120362 -0.0420872 -0.0088167 -0.051613 0.0532108 -0.042501 0.0547709 -0.0675047 0.0380911 -0.0195778 0.0193995 -0.0106633 0.0038539 -0.1065754 -0.0426204 0.0543712 -0.0677507 0.0378879 -0.0193179 0.0187454 -0.0108651 0.0032643 -0.1067396 0.0067426 0.1170901 -0.0569518 0.1635099 -0.0486739 0.0227274 -0.0412451 -0.0043395 0.0812359 -0.0789047 -0.1023705 0.0637916 -0.0641741 0.0758286 0.01316 0.0762475 0.0203738 0.0690874 0.1169133 -0.0164081 0.0116755 0.0050725 0.0834133 0.0370091 -0.0085114 -0.0292202 -0.1181981 -0.0789954 -0.1019684 0.0643473 -0.0636457 0.0761469 0.0130939 0.0766149 0.020207 0.0690621 0.1169501 -0.0161135 0.0120913 0.0050283 0.0833773 0.0354669 -0.008203 -0.0306728 -0.1182891 0.006884 0.1164433 -0.0580114 0.1630103 -0.0484102 0.0237398 -0.0426131 -0.0035165 0.0808523 unknown
polarizability: 135.7621848|-28.9209567|97.6417287|5.8544081|-4.8383501|63.6108339 unknown
InChI: InChI=1S/C6H12Br2/c1-5(7)3-4-6(2)8/h5-6H,3-4H2,1-2H3
charge 0 multiplicity 1
20 atoms
Br 3.482864 -1.085649 0.069946
Br -3.460002 1.093763 -0.064693
C  0.642385 -0.397546 0.221283
C  -0.619246 0.406214 -0.211659
C  1.931577 0.213268 -0.354946
C  -1.907971 -0.20141 0.368965
C  2.309886 1.59534 0.183812
C  -2.285288 -1.587469 -0.160049
H  0.715176 -0.424573 1.325986
H  0.55855 -1.442078 -0.127564
H  -0.693863 0.429552 -1.316299
H  -0.534121 1.451904 0.133455
H  1.918312 0.198408 -1.45829
H  -1.89464 -0.178796 1.472167
H  1.536968 2.334264 -0.104368
H  3.273295 1.935665 -0.229957
H  2.387918 1.583256 1.284888
H  -3.249227 -1.924915 0.254835
H  -2.361626 -1.583683 -1.261307
H  -1.512647 -2.324017 0.134894
