program: Gaussian 09
title: 000091320
version: EM64L-G09RevD.01
frameworkgroup: C1[X(C12H28O3Si)]
method: RPBEPBE
basis: SDD
operation: Freq
keyword: #p
keyword: freq=noraman
keyword: PBEPBE/SDD
title: #p freq=noraman PBEPBE/SDD
converged: YES YES NO NO
title: Mulliken charges:
elementType: Si O O O C C C C C C C C C C C C H H H H H H H H H H H H H H H H H H H H H H H H H H H H
charge: 1.522270 -0.603900 -0.591410 -0.588503 -0.873100 -0.310094 -0.194909 -0.214438 -0.214952 -0.681443 -0.370214 -0.367228 -0.367827 -0.681148 -0.681403 -0.681170 0.246787 0.243577 0.208466 0.217301 0.190508 0.199878 0.193535 0.188286 0.183899 0.193953 0.207147 0.208519 0.219793 0.208652 0.211378 0.215480 0.213760 0.214096 0.216071 0.209210 0.208637 0.222710 0.207613 0.206972 0.224069 0.207321 0.207196 0.224657
chargesum: 0.00000
title: Mulliken charges with hydrogens summed into heavy atoms:
elementType: Si O O O C C C C C C C C C C C C
charge: 1.522270 -0.603900 -0.591410 -0.588503 -0.382737 0.115673 0.195478 0.167383 0.162899 -0.045984 0.049816 0.062012 0.062340 -0.040591 -0.042750 -0.041996
polarizability: 1.79625922e+02 -6.65745598e-01 1.72266835e+02 9.88494811e-01 -3.54972631e+00 1.43905455e+02
1716.lowfreq: -39.3929 -25.2602 -18.4763 -11.5313 -9.0521 -0.0022 -0.0018 -0.0015 6.5582
frequency: -38.9211 -24.1089 -16.4494 -4.5081 20.8145 31.6464 34.7027 39.3963 46.2550 54.4563 91.0352 101.3387 106.7425 126.2398 134.7111 200.5693 201.8923 212.6419 216.4275 219.2835 223.4126 233.2000 235.3817 247.4765 257.2157 296.1816 331.4746 354.1303 414.5396 423.8481 459.4978 637.6919 704.5569 745.9953 751.5223 754.9126 755.6217 757.2009 784.8936 827.2322 877.7587 878.1609 879.4350 890.7234 893.0072 896.0511 900.8954 1020.5519 1028.5711 1035.7954 1046.8767 1049.8884 1050.2496 1050.3602 1063.6353 1084.7343 1126.4625 1126.8590 1127.8860 1140.3317 1142.0212 1144.2789 1211.0479 1225.1771 1226.5620 1228.3776 1237.4282 1275.9456 1278.3939 1279.5020 1292.3441 1300.5634 1300.8728 1302.7008 1337.8509 1367.1078 1370.0100 1371.6166 1382.7789 1390.1355 1390.4568 1390.6047 1431.1147 1469.3713 1470.0092 1471.3356 1472.9232 1473.4049 1478.7714 1479.1977 1479.6469 1479.8998 1480.4041 1482.2718 1484.8333 1489.1127 1489.7292 1492.0232 2923.9798 2928.2606 2944.4340 2970.0049 2974.1577 2974.2959 2975.0108 2976.6590 2977.1496 2979.5757 2986.7659 2997.3565 2997.9099 3001.9265 3002.9631 3018.4964 3045.3895 3047.0747 3048.1670 3048.4826 3070.3048 3070.8680 3076.0057 3077.2973 3077.6918 3078.3334 3078.4247 3078.7191
redmass: 1.8203 2.2640 2.3818 2.8724 2.0993 2.6839 2.2927 1.9253 3.0087 3.7822 3.8371 3.1207 2.5646 2.9964 3.2512 2.9082 3.0119 1.1463 1.4008 1.0914 2.2553 1.1019 3.6720 3.9327 3.6665 3.1662 3.7279 3.9351 5.1738 4.4770 7.5098 5.3172 1.4869 4.8176 2.2461 1.0863 1.0817 1.0854 5.2526 1.4525 1.1456 1.1432 1.1434 1.7709 1.7908 1.8173 2.1495 1.3578 8.6122 5.0113 3.4264 2.7386 2.7480 2.5971 5.5630 2.2471 2.1844 2.1955 2.2078 1.4670 1.4755 1.5001 1.4188 1.2679 1.2621 1.2526 1.3705 1.1021 1.1016 1.1015 1.0929 1.3369 1.3463 1.3437 1.4239 1.4067 1.4001 1.3875 1.2102 1.2099 1.2093 1.2097 1.0787 1.0665 1.0652 1.0616 1.0464 1.0476 1.0501 1.0491 1.0505 1.0551 1.0536 1.0671 1.0805 1.0810 1.0831 1.0837 1.0554 1.0551 1.0559 1.0353 1.0366 1.0364 1.0359 1.0821 1.0819 1.1054 1.0594 1.1016 1.0638 1.0604 1.0604 1.0992 1.1007 1.1018 1.1010 1.1009 1.1008 1.0996 1.1027 1.1029 1.1029 1.0987 1.0990 1.0987
irintensity: 0.1644 0.0025 0.0210 0.5928 1.0481 0.6284 0.4473 0.7555 1.0843 1.3558 1.2014 0.1170 0.1807 4.0909 9.3705 3.4922 3.7429 0.7784 4.5270 0.1508 9.0919 0.3978 4.0904 8.1706 9.1747 1.9434 4.3286 2.2660 9.6150 18.8577 52.5917 6.3855 0.1608 102.3633 71.8620 5.2786 3.7892 8.2313 99.1547 30.9423 2.5990 3.4566 2.7336 3.0379 14.8295 9.8282 8.1625 17.6375 353.5925 710.4664 4.6415 33.8718 15.4726 7.0851 48.2031 12.5657 1.8422 1.2791 1.1846 0.1763 2.1229 1.0059 1.8917 0.1287 0.0891 0.0904 20.9379 0.3848 0.8316 0.8687 0.8995 0.0740 0.0212 0.1184 5.0083 16.9561 5.8401 4.9482 10.9342 24.0075 15.2193 17.3645 17.6878 1.5674 3.7565 1.6413 10.8067 4.7962 10.0282 6.9219 5.6517 9.5424 7.1847 1.6663 22.2338 29.7447 5.3224 1.5530 54.7900 52.7360 43.5816 44.7375 74.5070 10.4190 39.7003 18.9120 17.1455 47.2727 32.4217 27.7640 27.5124 24.0224 27.2118 1.0515 10.7278 1.9155 0.0210 0.1809 68.2755 48.4839 94.9566 74.6573 111.4049 29.0212 39.9806 56.3613
temp: 298.150 k
press: 1.00000 atm
elementType: 14 8 8 8 6 6 6 6 6 6 6 6 6 6 6 6 1 1 1 1 1 1 1 1 1 1 1 1 1 1 1 1 1 1 1 1 1 1 1 1 1 1 1 1
symmnumber: 1
zpe: 1009037.5 jmol-1
zpe.correction: 0.384322 hartree
zpe.thermalcorrener: 0.405100 hartree
zpe.thermalcorrenthalpy: 0.406045 hartree
zpe.thermalcorrgfe: 0.331733 hartree
zpe.sumelectzpe: -987.851356 hartree
zpe.sumelectthermal: -987.830577 hartree
zpe.sumelectthermalent: -987.829633 hartree
zpe.sumelectthermalfe: -987.903944 hartree
dipole: 0.1171 0.3197 1.2598
dipole: 1.3050
quadrupole: -98.2504 -102.8728 -113.8159
quadrupole: 0.4909 0.5285 -2.8689
quadrupole: 6.7293 2.1069 -8.8362 0.4909 0.5285 -2.8689
hfenergy: -988.2356777 hartree
pointgroup: C01 [X(C12H28O3Si1)]
dipole: 0.0605653 0.1033944 0.4992383 debye
polarizability: 178.941738|-2.123163|173.0455144|1.0084003|-3.2108352|143.8109594 unknown
InChI: InChI=1S/C12H28O3Si/c1-5-9-13-16(12-8-4,14-10-6-2)15-11-7-3/h5-12H2,1-4H3
charge 0 multiplicity 1
44 atoms
Si -0.04596 -0.330474 0.291986
O  -0.202682 1.170457 1.133438
O  -1.362304 -0.576698 -0.791961
O  1.283864 -0.310849 -0.803335
C  0.095142 -1.661865 1.631063
C  0.218963 -3.102935 1.06908
C  -0.247091 2.498454 0.504071
C  -2.779079 -0.401188 -0.457668
C  2.698842 -0.365145 -0.423445
C  0.340395 -4.159532 2.188199
C  -0.053476 3.557562 1.595118
C  -3.581149 -0.392234 -1.764421
C  3.53375 -0.410042 -1.708556
C  -0.114874 4.992204 1.025425
C  -5.097573 -0.241245 -1.513165
C  5.048932 -0.469366 -1.415144
H  -0.794023 -1.586088 2.288317
H  0.967761 -1.426281 2.272705
H  1.100857 -3.169988 0.400851
H  -0.659387 -3.330524 0.433801
H  -1.226796 2.636353 -0.000436
H  0.546434 2.580799 -0.268228
H  -2.934113 0.54811 0.099809
H  -3.119403 -1.236206 0.193051
H  2.900015 -1.268056 0.195029
H  2.969767 0.528057 0.180137
H  1.233639 -3.973047 2.813911
H  -0.543965 -4.137081 2.852809
H  0.425028 -5.179789 1.77031
H  0.919475 3.379954 2.091007
H  -0.834643 3.415004 2.365473
H  -3.370925 -1.332239 -2.307957
H  -3.208112 0.43247 -2.400035
H  3.290682 0.483485 -2.31334
H  3.217843 -1.289568 -2.299946
H  0.674417 5.158994 0.268127
H  -1.090726 5.191338 0.543319
H  0.023484 5.741229 1.825493
H  -5.488024 -1.07229 -0.895491
H  -5.327867 0.705479 -0.988467
H  -5.656089 -0.240777 -2.466178
H  5.383676 0.415561 -0.84112
H  5.311376 -1.370482 -0.828876
H  5.630316 -0.499418 -2.353862
