program: Gaussian 09
title: 000091205
version: EM64L-G09RevD.01
frameworkgroup: C1[X(C13H17N5O5)]
method: RPBEPBE
basis: SDD
operation: Freq
keyword: #p
keyword: freq=noraman
keyword: PBEPBE/SDD
title: #p freq=noraman PBEPBE/SDD
converged: YES YES NO NO
title: Mulliken charges:
elementType: O O O O O N N N N N C C C C C C C C C C C C C H H H H H H H H H H H H H H H H H
charge: -0.294195 -0.173859 -0.223013 -0.215146 -0.200050 -0.074321 -0.122861 -0.383474 0.092538 0.050431 -0.333320 -0.412315 -0.422452 -0.320107 -0.492015 0.232270 0.263371 -0.760812 -0.369904 0.382286 -0.308086 0.275258 -0.299163 0.261857 0.188061 0.195547 0.230662 0.216064 0.285998 0.234021 0.210040 0.250097 0.189422 0.266427 0.226049 0.230905 0.287831 0.242995 0.296814 0.296151
chargesum: 0.00000
title: Mulliken charges with hydrogens summed into heavy atoms:
elementType: O O O O O N N N N N C C C C C C C C C C C C C
charge: -0.294195 -0.173859 -0.223013 -0.215146 -0.200050 -0.074321 -0.122861 -0.095644 0.092538 0.050431 0.116599 0.013894 0.079609 0.123955 -0.052496 0.232270 0.263371 -0.037431 -0.126909 0.382286 -0.011272 0.275258 -0.003013
polarizability: 4.81569145e+02 1.29438487e+01 1.74834077e+02 2.28276335e+01 -1.50992541e+01 1.33645546e+02
1716.lowfreq: -10.4650 -5.6231 -0.0009 -0.0006 0.0005 3.3895 4.4393 10.7549 13.7982
frequency: -8.3328 9.9299 13.3579 29.2119 42.9192 46.9185 73.4298 83.7801 103.4137 113.4135 122.6367 134.1461 148.0604 153.7221 205.9195 212.8158 231.0812 240.7989 259.7149 292.0081 309.5631 323.9379 338.3329 360.0293 396.8068 401.1360 459.5376 484.2916 491.8879 542.8530 555.2308 562.6382 572.9893 578.7269 609.9628 639.9922 657.0529 680.1071 700.3386 708.2148 732.9875 760.2247 780.6264 827.3673 859.5056 911.5911 912.2625 917.5712 920.5595 924.2447 949.3090 962.4218 977.4892 998.4733 1006.8707 1019.4835 1029.5664 1048.9787 1058.5006 1073.9591 1102.2483 1131.9894 1138.0689 1165.2429 1171.4988 1173.8090 1203.7065 1221.0745 1223.7155 1232.5583 1261.9442 1264.3066 1288.2641 1299.9838 1330.3716 1334.9636 1340.1701 1343.9061 1355.6138 1371.6789 1373.1575 1374.0110 1388.1605 1394.1786 1437.0981 1445.9453 1467.7062 1468.8416 1469.2334 1476.2391 1492.9071 1499.0968 1509.4365 1549.4646 1586.0846 1598.1588 1667.5535 2768.0765 2858.2558 2906.3613 2963.2316 2975.2049 2986.0495 2999.2335 3017.2378 3018.6714 3020.1466 3031.3687 3069.8970 3079.7375 3133.6017 3241.6078 3260.3121 3353.7713
redmass: 4.6326 8.2534 4.2269 5.2029 8.7379 6.8600 4.4477 2.4128 2.4914 3.8636 1.9850 7.9739 6.8119 4.5984 4.1723 4.3483 4.2096 3.1336 4.7323 3.0797 2.2619 2.8258 4.0707 4.7228 4.8479 7.5649 4.8300 4.8433 3.2822 4.2169 5.4850 5.7988 4.2392 3.4781 2.3104 1.3398 3.1921 8.6813 3.0713 5.2830 12.5095 3.7915 4.8145 1.3020 1.4885 2.6458 1.4066 6.3490 5.3073 1.5066 2.5024 4.1146 2.0907 2.2626 1.9955 1.2833 1.6768 2.5048 2.8033 1.9419 2.0950 5.5175 3.9608 2.4223 3.2215 1.5519 1.7246 1.7123 1.3172 1.2107 5.5284 2.3448 1.6016 1.7519 1.3786 1.8295 1.4625 7.1853 1.4386 1.6986 1.2887 3.6678 1.5322 2.3741 1.1130 1.1032 2.2337 1.0549 1.1098 1.0921 1.0807 1.0866 3.3054 6.1724 6.0415 6.8762 8.1834 1.0703 1.0722 1.0704 1.0578 1.0693 1.0383 1.0832 1.1006 1.0927 1.0883 1.0901 1.0978 1.0945 1.0980 1.0953 1.1046 1.0748
irintensity: 2.7687 0.4563 0.1375 1.5857 7.5455 6.3524 1.3529 2.5046 8.7018 2.8264 1.4791 0.0544 1.4902 0.5187 4.7530 4.6921 10.1178 28.6554 0.5383 2.1443 4.8262 8.1164 15.9863 3.3651 0.7311 0.1352 2.3066 2.0334 2.0647 19.5242 2.9605 0.8325 1.8805 9.5692 5.6297 49.1588 20.6801 15.4574 2.4137 10.2022 18.3890 7.0585 4.7894 57.3154 0.5226 2.4359 4.2991 3.0933 32.9446 36.8464 4.7963 38.9120 44.0414 26.3856 5.4418 55.1577 4.9044 70.2343 13.2624 2.2803 46.5037 560.1625 205.7659 26.1963 239.3334 16.8656 29.0437 274.0837 11.4257 5.7464 360.0965 98.5909 105.0279 29.6015 20.5095 5.4611 66.8396 119.3008 9.5418 18.7430 16.6334 21.3732 105.2582 153.2565 15.4600 48.0074 562.1159 34.0206 9.0596 13.5161 9.2072 11.0326 21.9410 76.9210 41.4420 267.2892 181.0352 166.9243 149.4874 71.8965 58.4188 41.2383 11.2706 15.3646 17.6385 59.0221 28.5020 41.0558 17.2843 10.7518 11.1781 0.2271 6.4866 0.9089
temp: 298.150 k
press: 1.00000 atm
elementType: 8 8 8 8 8 7 7 7 7 7 6 6 6 6 6 6 6 6 6 6 6 6 6 1 1 1 1 1 1 1 1 1 1 1 1 1 1 1 1 1
symmnumber: 1
zpe: 797897.5 jmol-1
zpe.correction: 0.303903 hartree
zpe.thermalcorrener: 0.325735 hartree
zpe.thermalcorrenthalpy: 0.326679 hartree
zpe.thermalcorrgfe: 0.248522 hartree
zpe.sumelectzpe: -1153.573168 hartree
zpe.sumelectthermal: -1153.551336 hartree
zpe.sumelectthermalent: -1153.550392 hartree
zpe.sumelectthermalfe: -1153.628549 hartree
dipole: -4.4854 -5.5582 -1.9471
dipole: 7.4029
quadrupole: -212.1809 -130.5478 -135.6255
quadrupole: 33.5157 7.8848 -3.5697
quadrupole: -52.7295 28.9036 23.8259 33.5157 7.8848 -3.5697
hfenergy: -1153.8770712 hartree
pointgroup: C01 [X(C13H17N5O5)]
dipole: -1.7765257 2.3039184 -0.1370826 debye
polarizability: 482.3730448|-17.8809558|158.5716178|-8.8345082|-25.6309428|149.1041063 unknown
InChI: InChI=1S/C13H17N5O5/c1-10(19)17-6-4-16(5-7-17)9-12(20)15-14-8-11-2-3-13(23-11)18(21)22/h2-3,8,15H,4-7,9H2,1H3
charge 0 multiplicity 1
40 atoms
O  -7.016499 -2.196424 -0.714135
O  -1.012722 -0.187774 1.206377
O  5.156923 0.394637 -0.38421
O  8.424393 -0.795999 0.481868
O  7.748828 0.70106 -1.133399
N  -3.224618 0.905364 -0.280541
N  -5.830533 -0.217281 -0.394995
N  0.468867 0.908131 -0.253998
N  1.590072 0.314527 0.265811
N  7.518595 -0.117373 -0.158533
C  -3.410045 -0.410772 -0.9475
C  -4.391776 1.797794 -0.271341
C  -4.858983 -0.57608 -1.448694
C  -5.604529 1.057606 0.328207
C  -1.911266 1.500474 -0.386176
C  -6.863937 -1.101144 -0.086206
C  -0.81563 0.635959 0.290045
C  -7.802918 -0.677848 1.041576
C  2.755191 0.621905 -0.277065
C  3.952186 0.01037 0.244847
C  4.225594 -0.913929 1.266222
C  6.167104 -0.31347 0.274624
C  5.639511 -1.118978 1.283497
H  -3.150392 -1.222183 -0.242114
H  -2.731484 -0.503112 -1.828241
H  -4.659837 2.198052 -1.281114
H  -4.172174 2.6703 0.37164
H  -5.027527 0.049004 -2.348476
H  -5.059256 -1.623676 -1.728114
H  -5.397759 0.858046 1.397953
H  -6.49917 1.709568 0.264413
H  -1.913558 2.480791 0.132174
H  -1.591255 1.703706 -1.447426
H  -8.532066 -1.486327 1.194633
H  -8.347922 0.251181 0.789874
H  -7.256952 -0.501601 1.986511
H  0.534802 1.562721 -1.051174
H  2.890368 1.325465 -1.119513
H  3.476164 -1.371411 1.907455
H  6.21651 -1.766179 1.938636
