program: Gaussian 09
title: 000009615
version: EM64L-G09RevD.01
frameworkgroup: C1[X(C7H15FO)]
method: RPBEPBE
basis: SDD
operation: Freq
keyword: #p
keyword: freq=noraman
keyword: PBEPBE/SDD
title: #p freq=noraman PBEPBE/SDD
converged: YES YES NO NO
title: Mulliken charges:
elementType: F O C C C C C C C H H H H H H H H H H H H H H H
charge: -0.251222 -0.269834 -0.361433 -0.353455 -0.386263 -0.401567 -0.278298 -0.218707 -0.498540 0.182157 0.190619 0.188582 0.223034 0.210882 0.215229 0.193910 0.222014 0.183738 0.185589 0.200843 0.193007 0.232898 0.197936 0.198877
chargesum: 0.00000
title: Mulliken charges with hydrogens summed into heavy atoms:
elementType: F O C C C C C C C
charge: -0.251222 -0.269834 0.011344 0.058162 0.039849 0.014357 0.091029 0.175143 0.131172
polarizability: 1.03754154e+02 1.74172849e+00 7.06160986e+01 -9.89617382e-01 6.24559529e-01 6.79083994e+01
1716.lowfreq: -5.3885 -0.0009 -0.0006 -0.0002 6.7058 19.1730 39.8149 51.1375 71.8387
frequency: 39.5354 50.6310 71.8308 87.5341 108.9861 129.5364 143.9284 198.7424 231.5395 253.1293 314.0819 386.6076 473.1039 503.8871 734.9124 761.4208 816.9088 869.2526 882.6810 898.4039 965.6926 1016.3707 1034.1337 1063.2496 1072.6674 1085.8386 1105.3112 1111.4222 1134.9398 1156.6579 1160.6678 1194.6476 1229.7618 1251.5869 1273.1039 1286.1974 1295.7266 1307.8133 1352.9598 1370.4437 1374.9078 1384.7729 1438.6937 1443.9353 1458.3400 1466.8819 1468.3364 1468.6207 1473.1814 1484.4636 1493.4457 2900.2023 2921.0726 2946.8170 2953.1543 2968.3739 2972.8024 2990.4417 2992.4781 2998.0243 3001.4266 3024.2902 3047.5295 3060.3476 3074.9249 3100.8070
redmass: 3.5007 2.6636 3.2629 2.9260 2.1809 2.5255 2.2316 2.5053 1.2042 3.8579 2.9612 3.3592 2.9729 2.7965 1.1027 1.2267 1.4689 2.4898 3.5704 1.7614 1.5077 2.7527 3.8801 2.4252 4.8433 2.0574 2.5856 1.2578 1.6546 1.4043 1.3485 1.2976 1.3480 1.2881 1.1491 1.1190 1.1039 1.2905 1.4561 1.4871 1.3519 1.4028 1.1608 1.0821 1.0512 1.0687 1.0841 1.0753 1.0777 1.0893 1.0888 1.0529 1.0358 1.1056 1.0590 1.0614 1.0639 1.1025 1.0616 1.0943 1.0592 1.0949 1.1026 1.1040 1.1106 1.0967
irintensity: 1.2486 2.6832 0.7804 3.3758 5.8466 1.5166 1.3880 0.5041 3.8014 2.4019 2.8980 7.0565 1.8096 2.9082 7.9575 3.8153 5.5211 11.5748 23.3638 4.3032 19.5574 13.5169 23.0484 9.2939 94.9779 4.1399 15.9232 0.0879 3.2357 1.7710 4.0485 12.4505 4.7131 4.4510 0.0332 0.7388 0.7918 0.3628 0.0642 4.1930 5.9456 20.8295 0.4720 7.1876 11.9073 11.2951 2.5785 1.8643 3.0407 6.5464 12.0772 51.1328 103.6971 62.8448 24.6804 3.4820 53.4057 77.8455 34.8295 21.3466 50.7940 8.5118 15.3582 117.2051 62.5084 34.0940
temp: 298.150 k
press: 1.00000 atm
elementType: 9 8 6 6 6 6 6 6 6 1 1 1 1 1 1 1 1 1 1 1 1 1 1 1
symmnumber: 1
zpe: 552280.7 jmol-1
zpe.correction: 0.210353 hartree
zpe.thermalcorrener: 0.222139 hartree
zpe.thermalcorrenthalpy: 0.223083 hartree
zpe.thermalcorrgfe: 0.171026 hartree
zpe.sumelectzpe: -450.016213 hartree
zpe.sumelectthermal: -450.004427 hartree
zpe.sumelectthermalent: -450.003483 hartree
zpe.sumelectthermalfe: -450.055540 hartree
dipole: -0.8394 3.3217 -0.1564
dipole: 3.4297
quadrupole: -55.5151 -58.8061 -55.8620
quadrupole: 3.9900 -7.6727 -0.0034
quadrupole: 1.2126 -2.0784 0.8658 3.9900 -7.6727 -0.0034
hfenergy: -450.2265658 hartree
pointgroup: C01 [X(C7H15F1O1)]
dipole: -0.3208045 1.3078255 -0.086132 debye
dipolederiv: -0.4165237 0.1012709 -0.0266714 0.1837609 -0.6216874 0.1525315 -0.0778498 0.1848887 -0.3776977 -1.146825 -0.0516494 0.021028 -0.1199641 -0.4221493 0.0190574 -0.0199831 0.0130722 -0.4285126 -0.0299541 -0.0077406 0.0125534 0.020561 0.1278777 -0.0537882 0.0318914 -0.0473195 0.1628349 -0.0116223 -0.0045186 0.0174962 -0.0277503 0.0550431 -0.0211248 -0.0077966 -0.0414411 0.1622365 -0.133554 -0.0066864 0.0160635 0.0138992 0.0880185 -0.0305286 0.0286652 -0.0301138 0.1254169 -0.1474093 0.0726583 0.01788 0.1024785 0.0509058 -0.0159696 0.0840625 -0.0495882 0.0973314 0.6620796 0.1340119 0.066568 0.2327686 0.4079851 -0.0525428 0.1261873 -0.0443934 0.4254754 0.4634589 -0.1077945 0.0414753 -0.1700997 0.6685178 -0.1438185 0.0319733 -0.1286359 0.4888605 0.6568461 -0.060661 -0.0570799 -0.2092887 0.2929267 -0.0379187 -0.1482954 -0.0488298 0.3609245 0.034592 0.0174613 -0.0052189 0.0130576 -0.1766386 0.0701148 -0.0081409 0.0980316 0.032981 0.0432298 -0.0045343 -0.0034626 -0.0036353 0.054892 -0.0324847 -0.0064011 -0.0586125 -0.1892535 0.0311566 -0.0085769 -0.0031526 -0.0041036 0.0589722 -0.034966 0.0097802 -0.0571415 -0.1875051 0.0677173 0.0022907 -0.0000204 0.0057226 -0.1123162 0.0585639 0.0010679 0.0798266 0.0453484 0.0609184 -0.0063274 0.0100687 0.0056858 0.0667353 -0.023283 0.0016673 -0.0410549 -0.1593596 0.0587271 0.0288692 -0.0159347 0.0249232 -0.1279034 0.0641629 -0.0032677 0.0817624 0.044628 0.0522452 0.0325507 -0.0177817 -0.0270705 -0.1300587 0.09137 0.004796 0.1155853 0.0396074 0.0384743 0.0098788 0.0196674 -0.0256477 0.0758652 -0.0419299 -0.0093806 -0.0736848 -0.1473493 -0.0307131 0.028957 -0.0266127 -0.041002 -0.222612 0.0644833 -0.0306411 0.1030622 0.0033692 -0.0261353 -0.0199877 0.0175044 -0.0512461 0.0202377 -0.0186887 -0.0397751 -0.0643371 -0.2393686 -0.1642172 -0.1021663 -0.0255597 -0.0872494 -0.0489452 0.0202073 -0.0789406 -0.0141539 0.0541473 0.0786103 0.010365 -0.0223449 0.0424694 -0.0008704 -0.0558874 0.0380087 -0.0128728 -0.1749436 -0.0977671 -0.0915244 -0.0404135 -0.1233466 0.0018967 -0.0578604 -0.0598393 -0.0601127 0.0791837 -0.0267121 0.022703 0.0094348 0.1709982 -0.1768006 0.1045609 0.0044033 0.1075925 0.0181468 -0.0166224 0.0111506 -0.0054865 0.074079 0.070108 -0.0242607 0.1278084 -0.0115296 -0.2365017 unknown
polarizability: 103.7754306|1.4813119|70.6155586|-1.054764|0.5784214|67.887663 unknown
InChI: InChI=1S/C7H15FO/c1-9-7-5-3-2-4-6-8/h2-7H2,1H3
charge 0 multiplicity 1
24 atoms
F  4.137162 -1.072583 0.474941
O  -3.563281 -0.526608 -0.22743
C  0.069013 0.588375 0.166455
C  1.40359 -0.040133 -0.290587
C  -1.156929 -0.260382 -0.239772
C  2.630773 0.815539 0.091465
C  -2.479981 0.352605 0.227538
C  3.961514 0.172951 -0.289923
C  -4.878911 -0.034606 0.171002
H  -0.025376 1.608388 -0.263093
H  0.086048 0.714153 1.269413
H  1.383668 -0.186363 -1.390796
H  1.514459 -1.045893 0.158973
H  -1.191736 -0.374756 -1.340522
H  -1.06967 -1.279069 0.184654
H  2.572799 1.804514 -0.410632
H  2.628694 1.011736 1.181705
H  -2.614224 1.373718 -0.199859
H  -2.502563 0.441625 1.338608
H  4.824591 0.815189 -0.035511
H  3.994898 -0.111453 -1.35881
H  -5.613099 -0.758774 -0.21614
H  -5.088985 0.968191 -0.260925
H  -4.974251 0.029638 1.276846
