program: Gaussian 09
title: 000091167
version: EM64L-G09RevD.01
frameworkgroup: C1[X(C11H22O2)]
method: RPBEPBE
basis: SDD
operation: Freq
keyword: #pfreq=noraman
keyword: PBEPBE/SDD
title: #p freq=noraman PBEPBE/SDD
converged: YES YES NO NO
title: Mulliken charges:
elementType: O O C C C C C C C C C C C H H H H H H H H H H H H H H H H H H H H H H
charge: -0.418710 -0.236723 -0.380673 -0.383908 -0.384078 -0.401109 -0.372985 -0.133026 -0.353567 -0.356597 -0.715135 0.161360 -0.696657 0.198831 0.188396 0.217496 0.186992 0.195510 0.190762 0.195976 0.221640 0.191217 0.188348 0.237940 0.188682 0.187193 0.194306 0.195329 0.227327 0.223611 0.235272 0.210012 0.209372 0.214853 0.372744
chargesum: 0.00000
title: Mulliken charges with hydrogens summed into heavy atoms:
elementType: O O C C C C C C C C C C C
charge: -0.045966 -0.236723 0.006554 0.020580 0.002194 0.016507 0.006580 0.104915 0.022307 0.033038 -0.028926 0.161360 -0.062421
polarizability: 1.54343428e+02 4.25614076e-01 1.16350251e+02 4.26413107e+00 -2.32410836e-01 1.07454843e+02
1716.lowfreq: -0.0008 0.0000 0.0007 3.2506 6.0065 12.8872 20.3251 28.7354 43.9307
frequency: 20.0283 28.6990 43.2294 47.4603 68.6350 92.2742 109.0125 126.0718 142.8919 150.3119 177.8285 202.6263 226.7496 235.1646 242.6014 271.4030 319.7410 390.4051 428.7916 490.6204 503.3876 578.1564 613.5816 715.0706 721.4740 726.4337 738.3696 760.2574 796.6945 858.6183 888.1055 914.2981 933.6223 982.5732 990.5704 1018.5636 1018.9994 1030.4644 1039.1302 1060.3061 1079.1703 1080.3767 1086.8365 1107.5468 1126.0818 1159.4439 1188.9326 1217.7074 1225.2155 1243.5113 1255.4380 1264.3829 1280.6869 1283.2818 1288.5483 1296.5091 1301.5926 1307.0939 1334.2795 1351.9647 1355.8999 1358.7712 1363.0916 1386.1705 1388.6230 1453.7591 1460.4574 1461.7156 1465.1427 1470.0881 1472.2590 1477.0926 1477.7476 1481.1315 1484.0520 1488.3821 1660.7093 2949.5433 2950.2475 2952.8245 2956.9619 2962.2620 2967.4572 2971.4266 2977.8652 2983.5535 2986.3367 2990.6937 3000.9439 3011.3883 3016.3746 3026.6913 3038.3469 3050.6566 3067.9006 3070.3511 3087.2606 3093.3624 3503.7167
redmass: 8.9859 3.6868 1.7885 3.6478 3.3838 1.6421 3.0784 2.6318 1.8847 2.1813 3.0991 1.0936 2.9411 1.1278 3.6371 2.9795 3.2714 3.5716 3.2136 3.0162 3.2024 3.3260 1.2522 2.9063 1.0748 1.1902 1.4525 1.5812 1.3345 1.2631 1.9158 1.6588 1.3498 4.4779 1.3776 2.6620 2.2564 1.6053 2.5361 2.9592 2.2961 2.1987 2.4123 1.5661 2.4578 2.1126 1.7216 1.3047 1.4465 1.5275 1.2871 1.3038 1.1996 1.0833 1.1697 1.0936 1.1235 1.3328 1.4132 1.5340 1.6417 1.5684 1.6770 1.2549 1.2177 1.0790 1.0733 1.0690 1.0730 1.0791 1.0473 1.0765 1.0462 1.0641 1.0870 1.0908 8.0807 1.0587 1.0587 1.0593 1.0599 1.0599 1.0588 1.0364 1.0610 1.0954 1.0353 1.0970 1.0995 1.0954 1.0929 1.1027 1.1041 1.1033 1.1006 1.0993 1.1004 1.1007 1.0638
irintensity: 1.5333 0.1576 0.1076 0.1934 0.2480 0.0273 0.2061 0.0158 0.0277 0.0427 0.0429 0.2632 0.3105 0.0057 0.3954 2.7571 1.3117 1.6309 6.9463 0.6406 21.0268 6.7650 119.2686 32.6963 17.3994 4.9186 12.3105 0.6148 0.6616 0.8422 5.0517 0.4756 1.6693 3.7959 3.7915 22.8801 16.7332 29.6528 249.2743 1.1669 1.6188 0.0187 9.8146 9.6156 2.9897 6.5479 1.3167 9.3294 0.3215 3.9618 1.0764 2.1731 1.2127 2.1120 1.7231 0.2096 0.5691 1.5626 1.3031 0.3205 0.6141 1.1257 15.6434 15.6701 11.5819 3.5367 0.0295 0.2094 0.1402 2.0342 16.1167 1.3201 12.7500 12.6864 5.4631 28.2872 188.7931 0.0973 0.8676 0.7439 2.2707 44.2696 150.0445 37.2120 40.0215 3.3935 35.5264 3.0290 1.0665 2.6581 7.1151 2.0073 91.1754 108.2703 97.1617 56.0344 34.4449 28.9878 17.8266
temp: 298.150 k
press: 1.00000 atm
elementType: 8 8 6 6 6 6 6 6 6 6 6 6 6 1 1 1 1 1 1 1 1 1 1 1 1 1 1 1 1 1 1 1 1 1 1
symmnumber: 1
zpe: 816469.7 jmol-1
zpe.correction: 0.310977 hartree
zpe.thermalcorrener: 0.327904 hartree
zpe.thermalcorrenthalpy: 0.328849 hartree
zpe.thermalcorrgfe: 0.263582 hartree
zpe.sumelectzpe: -581.750411 hartree
zpe.sumelectthermal: -581.733483 hartree
zpe.sumelectthermalent: -581.732539 hartree
zpe.sumelectthermalfe: -581.797806 hartree
dipole: -0.3876 -0.7424 -1.2180
dipole: 1.4782
quadrupole: -79.4220 -78.5261 -86.9747
quadrupole: -0.3008 3.0176 -0.9495
quadrupole: 2.2190 3.1148 -5.3338 -0.3008 3.0176 -0.9495
hfenergy: -582.0613877 hartree
pointgroup: C01 [X(C11H22O2)]
dipole: 0.1495992 0.2648414 -0.4956726 debye
polarizability: 154.2845087|0.126587|116.348137|-4.5950515|-0.2555021|107.515876 unknown
InChI: InChI=1S/C11H22O2/c1-3-4-5-6-7-8-9-10(2)11(12)13/h10,12H,3-9H2,1-2H3
charge 0 multiplicity 1
35 atoms
O  4.507711 -1.626303 -0.670524
O  3.404636 -1.231667 1.330742
C  -0.544628 0.755046 0.149428
C  0.79523 0.178018 -0.359549
C  -1.771202 -0.084101 -0.273509
C  2.011754 1.030179 0.065627
C  -3.111141 0.492166 0.236992
C  3.366604 0.498101 -0.457738
C  -4.339773 -0.344756 -0.185029
C  -5.679335 0.232523 0.326742
C  4.529231 1.493408 -0.171847
C  3.715294 -0.838748 0.18411
C  -6.901517 -0.610031 -0.098258
H  -0.513039 0.825414 1.256588
H  -0.665026 1.793451 -0.225565
H  0.91565 -0.853617 0.028341
H  0.764483 0.101703 -1.466944
H  -1.651345 -1.121606 0.102602
H  -1.802089 -0.156876 -1.381047
H  1.882975 2.066439 -0.306917
H  2.054632 1.085139 1.171015
H  -3.080029 0.563713 1.3445
H  -3.230089 1.53076 -0.13759
H  3.312265 0.333298 -1.550564
H  -4.222951 -1.383381 0.189687
H  -4.372867 -0.41682 -1.292587
H  -5.795563 1.270082 -0.048399
H  -5.645009 0.304886 1.433144
H  4.623099 1.681206 0.91297
H  4.323023 2.456318 -0.672062
H  5.492374 1.106181 -0.54736
H  -6.823767 -1.643706 0.28888
H  -6.97656 -0.670855 -1.200594
H  -7.84554 -0.17713 0.281205
H  4.751712 -2.470236 -0.200587
