program: Gaussian 09
title: 000091149
version: EM64L-G09RevD.01
frameworkgroup: C1[X(C11H20O)]
method: RPBEPBE
basis: SDD
operation: Freq
keyword: #pfreq=noraman
keyword: PBEPBE/SDD
title: #p freq=noraman PBEPBE/SDD
converged: YES YES NO NO
title: Mulliken charges:
elementType: O C C C C C C C C C C C H H H H H H H H H H H H H H H H H H H H
charge: -0.281100 -0.000749 -0.605315 -0.439207 0.026269 -0.573673 0.617605 -0.361698 -0.726409 -0.350924 -0.792631 -0.697631 0.196746 0.211685 0.221511 0.204123 0.214409 0.196312 0.207061 0.209586 0.200688 0.185164 0.204555 0.222359 0.233981 0.197815 0.197152 0.222786 0.223087 0.209892 0.209345 0.217205
chargesum: 0.00000
title: Mulliken charges with hydrogens summed into heavy atoms:
elementType: O C C C C C C C C C C C
charge: -0.281100 0.195997 -0.172119 -0.020674 0.222581 -0.157026 0.617605 0.024154 -0.065514 0.044043 -0.346758 -0.061189
polarizability: 1.44679280e+02 1.64314479e+00 1.29618143e+02 -2.69440559e+00 -6.11928740e+00 9.31542393e+01
1716.lowfreq: -16.5488 -4.1904 -0.0010 0.0007 0.0007 4.6284 48.7871 52.5804 71.0993
frequency: 48.4156 52.3809 71.0865 116.7066 117.9158 126.5068 179.2056 208.0086 218.5173 233.6904 244.1084 295.9434 369.1131 377.1940 416.0112 452.4526 467.6015 493.8300 507.6810 621.6932 702.6254 729.8946 781.5483 803.1988 839.1999 851.2241 883.6014 896.3355 908.7720 931.6045 940.3262 970.6049 984.3566 1005.6558 1024.7685 1049.5184 1074.9419 1087.1837 1098.3217 1122.0811 1128.7091 1157.4848 1179.6633 1203.2089 1223.7293 1250.5610 1260.1925 1267.3515 1283.8199 1289.4197 1293.1075 1303.7348 1323.4932 1336.4737 1337.2133 1352.5781 1372.5940 1387.5719 1390.5017 1429.8127 1435.9497 1450.4808 1460.5254 1464.4288 1467.5958 1477.5261 1477.6282 1478.8500 1488.0241 1670.3389 2907.8160 2920.9218 2955.5775 2964.7041 2969.0044 2970.1719 2971.9449 2982.2003 2989.3055 2997.2462 3023.0488 3045.0784 3048.2803 3050.6880 3068.6266 3071.5289 3084.2731 3087.5953 3096.9284 3186.6641
redmass: 2.0772 2.0883 3.3448 2.6654 2.6339 2.3523 2.0376 1.2286 2.4502 1.2840 2.6928 2.9317 2.7027 2.9053 2.9663 2.2439 2.2521 2.5022 3.4798 3.6043 1.0947 1.0803 1.2548 3.0994 2.2629 2.7073 1.4584 1.7542 1.7486 1.7762 1.3845 1.5291 1.4844 3.5292 3.1202 1.8797 2.4195 2.1384 1.9215 2.2232 1.9076 2.2100 1.5155 1.3875 1.3321 1.2656 1.2947 1.2872 1.2667 1.0874 1.1622 2.7484 1.3364 1.4860 1.4211 1.5858 1.4821 1.2891 1.2242 1.1341 1.0973 1.1234 1.0545 1.0739 1.0730 1.0477 1.0450 1.0652 1.0865 5.5551 1.0829 1.0834 1.0591 1.0628 1.0585 1.0620 1.0373 1.0595 1.0357 1.0978 1.1024 1.0990 1.1026 1.0980 1.1008 1.0992 1.0625 1.0994 1.0999 1.1138
irintensity: 0.0213 0.0409 0.0958 0.4451 0.1358 0.5817 2.2234 0.4956 0.7392 0.2091 0.1955 0.2342 0.9190 3.0224 0.7012 1.5899 2.9724 4.2039 4.0924 19.0089 0.0379 11.2706 1.3068 8.1011 5.0278 4.9183 0.2978 9.5920 7.0884 22.8946 55.7853 2.5240 1.2244 78.1166 1.5981 23.6778 1.0436 3.8267 23.2235 15.1402 10.9369 8.6042 10.8452 2.5927 5.6294 1.9943 9.5656 2.2800 3.1318 0.9323 9.3968 20.7885 2.5883 20.0777 31.4097 0.7753 2.4452 25.4621 9.2686 4.8571 10.4042 3.1747 12.8554 0.9226 0.9210 12.5159 6.2484 3.8149 17.3008 38.9163 28.4608 57.3614 8.4888 23.8993 48.5472 29.2275 32.9789 52.4772 29.3174 0.6586 8.4800 33.9221 45.3112 38.7174 97.9902 54.0224 9.1491 37.4766 29.9758 23.6430
temp: 298.150 k
press: 1.00000 atm
elementType: 8 6 6 6 6 6 6 6 6 6 6 6 1 1 1 1 1 1 1 1 1 1 1 1 1 1 1 1 1 1 1 1
symmnumber: 1
zpe: 749687.7 jmol-1
zpe.correction: 0.285541 hartree
zpe.thermalcorrener: 0.299448 hartree
zpe.thermalcorrenthalpy: 0.300392 hartree
zpe.thermalcorrgfe: 0.244723 hartree
zpe.sumelectzpe: -505.394614 hartree
zpe.sumelectthermal: -505.380707 hartree
zpe.sumelectthermalent: -505.379763 hartree
zpe.sumelectthermalfe: -505.435432 hartree
dipole: 0.0612 0.6642 -0.4291
dipole: 0.7931
quadrupole: -70.7813 -79.2461 -75.8796
quadrupole: -0.9146 -1.1266 0.3957
quadrupole: 4.5211 -3.9438 -0.5773 -0.9146 -1.1266 0.3957
hfenergy: -505.6801553 hartree
pointgroup: C01 [X(C11H20O1)]
dipole: -0.0243367 -0.2594853 -0.1715659 debye
polarizability: 144.685129|1.613862|129.4820045|2.6705712|6.5049169|93.2845293 unknown
InChI: InChI=1S/C11H20O/c1-4-5-6-11-8-9(2)7-10(3)12-11/h10-11H,2,4-8H2,1,3H3
charge 0 multiplicity 1
32 atoms
O  -0.940238 1.274006 0.078303
C  0.057892 0.224825 -0.229246
C  -0.334742 -1.104143 0.475304
C  1.411765 0.794479 0.217928
C  -2.300894 0.914336 -0.376126
C  -2.772787 -0.38418 0.336414
C  -1.762525 -1.501823 0.136283
C  2.624463 -0.080423 -0.171963
C  -3.186126 2.124513 -0.075265
C  3.974162 0.585244 0.182592
C  -2.097411 -2.729745 -0.339207
C  5.191611 -0.283786 -0.198717
H  0.064062 0.053094 -1.332029
H  -0.237455 -0.938487 1.568842
H  0.369947 -1.905833 0.188561
H  1.387227 0.944548 1.315837
H  1.518342 1.798677 -0.237099
H  -2.265588 0.722121 -1.473678
H  -3.769633 -0.678223 -0.041884
H  -2.871634 -0.150522 1.416827
H  2.567373 -1.065119 0.334973
H  2.598625 -0.287691 -1.262761
H  -4.225204 1.939222 -0.402866
H  -3.189963 2.333536 1.009433
H  -2.805494 3.018693 -0.597689
H  3.997675 0.802592 1.269973
H  4.040624 1.565823 -0.331012
H  -1.344784 -3.513567 -0.487606
H  -3.134346 -2.988084 -0.585963
H  5.208523 -0.487258 -1.286226
H  5.162279 -1.258885 0.32361
H  6.142957 0.212759 0.066757
